program: Gaussian 09
title: 000152450
version: EM64L-G09RevD.01
frameworkgroup: C1[X(C12H9NO4)]
method: RPBEPBE
basis: SDD
operation: Freq
keyword: #p
keyword: freq=noraman
keyword: PBEPBE/SDD
title: #p freq=noraman PBEPBE/SDD
converged: YES YES NO NO
title: Mulliken charges:
elementType: O O O O N C C C C C C C C C C C C H H H H H H H H H
charge: -0.289916 -0.427078 -0.218104 -0.218096 0.020836 0.332411 0.324859 -0.345351 -0.312468 0.379348 -0.331585 -0.348219 -0.329975 -0.346666 -0.321525 -0.348357 0.282606 0.267788 0.275718 0.289711 0.286793 0.268866 0.260545 0.260746 0.228701 0.358414
chargesum: 0.00000
title: Mulliken charges with hydrogens summed into heavy atoms:
elementType: O O O O N C C C C C C C C C C C C
charge: -0.289916 -0.068663 -0.218104 -0.218096 0.020836 0.332411 0.324859 -0.077563 -0.036751 0.379348 -0.041874 -0.061426 -0.061109 -0.086121 -0.060779 -0.119656 0.282606
polarizability: 2.78563238e+02 -3.61613131e+00 1.34643512e+02 -1.33682272e+01 -2.44137789e+00 8.97889839e+01
1716.lowfreq: -5.4676 -0.0010 -0.0007 0.0006 6.4434 8.8428 23.7838 39.3822 52.9455
frequency: 23.7283 39.2431 52.9450 80.5751 104.8933 146.9609 199.7343 264.1410 278.4056 327.0791 343.7863 361.9421 398.9796 415.2893 418.8847 423.3542 484.1666 492.4270 510.4080 549.6544 607.0361 624.1195 640.0777 664.5829 697.5765 720.6070 734.1402 773.7541 802.1323 808.5729 828.8497 835.8698 854.6749 858.4492 927.4623 955.9777 982.9710 990.2614 995.6659 998.4476 1095.2458 1096.5390 1109.3423 1141.1681 1150.9046 1165.4653 1175.1273 1222.2745 1226.8284 1256.5544 1288.2013 1300.9320 1354.0334 1387.8318 1404.2884 1425.6198 1434.3174 1471.9820 1492.7648 1590.0142 1597.2867 1607.5222 1626.8318 3126.8437 3154.3697 3167.1191 3169.8061 3172.8680 3179.5166 3186.0854 3190.6552 3584.7678
redmass: 5.0408 6.4692 7.6875 5.5314 8.2278 7.0959 8.8490 7.0810 6.9333 6.2046 6.6781 1.1164 6.8413 3.0245 3.4914 4.0405 3.9906 3.3424 4.8727 5.1126 6.1398 7.0493 7.0293 4.8561 4.8725 5.2328 5.1334 7.9628 1.4084 4.4135 1.4884 1.3742 3.6143 2.0093 1.3449 1.3345 1.3167 1.3470 2.8764 2.7912 1.7567 2.1399 1.2451 1.3690 1.8765 1.3316 1.5283 3.7208 5.0052 3.4209 1.2846 1.3518 8.1550 5.7878 8.6568 3.3138 4.3800 2.4400 2.6831 7.7185 7.0855 6.6186 6.6483 1.0904 1.0895 1.0888 1.0894 1.0951 1.0969 1.0962 1.0972 1.0662
irintensity: 0.2841 0.3512 0.4579 0.1733 3.7258 1.0420 1.7323 2.6813 0.7885 3.1252 9.6962 146.7691 0.7698 1.3696 3.4365 3.8306 10.8914 27.8364 7.7063 10.2589 1.7871 7.1916 3.4773 20.2078 8.1934 15.3628 8.1978 5.5829 17.1238 19.5076 41.5669 34.6633 50.3352 56.9026 0.9387 0.5213 3.0358 0.1758 3.4525 18.4284 76.9501 8.5415 22.3601 333.3247 5.4259 189.5243 151.5736 755.6531 31.1780 12.0765 4.9494 11.9360 87.7860 53.7160 13.7837 14.8161 12.4440 162.3237 199.1505 30.4374 16.4124 194.6595 37.0165 18.8086 6.7130 1.0255 0.8485 3.2134 0.9722 0.9245 3.7460 58.5390
temp: 298.150 k
press: 1.00000 atm
elementType: 8 8 8 8 7 6 6 6 6 6 6 6 6 6 6 6 6 1 1 1 1 1 1 1 1 1
symmnumber: 1
zpe: 489098.8 jmol-1
zpe.correction: 0.186288 hartree
zpe.thermalcorrener: 0.200400 hartree
zpe.thermalcorrenthalpy: 0.201345 hartree
zpe.thermalcorrgfe: 0.143408 hartree
zpe.sumelectzpe: -817.030837 hartree
zpe.sumelectthermal: -817.016725 hartree
zpe.sumelectthermalent: -817.015781 hartree
zpe.sumelectthermalfe: -817.073717 hartree
dipole: 7.2506 1.6032 -1.1499
dipole: 7.5142
quadrupole: -115.4554 -98.8353 -93.5204
quadrupole: -7.1110 -12.3806 -1.6445
quadrupole: -12.8517 3.7684 9.0833 -7.1110 -12.3806 -1.6445
hfenergy: -817.2171253 hartree
pointgroup: C01 [X(C12H9N1O4)]
dipole: 2.8810452 -0.5787283 0.3232107 debye
dipolederiv: -2.4907531 -0.0289338 0.0391274 0.063817 -0.3682095 -0.0248953 -0.1579824 -0.0429079 -0.227019 -1.4363234 -0.4735327 0.0222867 -0.6616673 -0.5046152 -0.1941118 -0.0087461 -0.1976313 -0.2375999 -1.0695305 -0.1264859 -0.0737745 -0.2684468 -0.480079 -0.1080622 -0.1342729 -0.1082726 -0.2871011 -0.6618401 0.1528609 0.0537517 0.4092897 -0.7487285 -0.2135801 0.1597205 -0.210518 -0.3251377 2.2381514 -0.2238852 -0.0458872 -0.4074803 1.0186634 0.3442197 -0.115132 0.3427164 0.335566 2.0927258 -0.1601285 -0.1059036 -0.7384996 0.2425484 0.0946622 -0.063191 0.0866836 0.1607723 1.3316846 0.2393383 0.0079757 0.790558 0.1087223 -0.0108721 0.2634489 0.0434072 0.0342986 -0.7981432 0.0386617 0.0321043 -0.2074612 0.0734403 0.0932192 -0.0654315 0.0904732 -0.128363 -0.4741876 0.1014164 0.0556645 0.647626 -0.2019015 -0.0193824 0.217816 -0.0119067 -0.157306 -1.0960718 0.1949991 0.0647056 0.3392073 -0.1296623 -0.0668483 0.0813908 -0.0613277 -0.0006596 0.347248 -0.0537697 -0.0165423 -0.3840128 0.0833248 0.0734893 -0.1535776 0.0719989 -0.0640156 0.563039 -0.0979571 -0.0245521 0.07967 -0.0061036 0.0386916 0.0719373 0.027995 -0.0692492 -0.1497346 0.1028545 0.0057116 -0.0790522 -0.0173856 -0.1108288 0.0773522 -0.0459773 -0.0307682 -0.0670086 -0.0438322 0.1220699 0.0122783 0.0071444 -0.0264851 -0.00742 -0.1122155 -0.0223042 -0.2928212 -0.1205434 0.0754402 0.0852552 -0.0129949 -0.0684499 -0.1471531 -0.190776 -0.0471816 -0.249806 0.0122804 0.0224086 -0.3089435 -0.1840812 -0.1283718 0.2805118 -0.0031064 -0.0685995 1.2942565 0.5441285 0.0773344 0.7081442 0.3381373 0.0780094 0.0726571 0.0865374 0.0460209 0.0947706 0.042177 0.0112044 0.0346529 0.0091285 -0.0665861 0.0112235 -0.0656103 0.1368888 0.0408301 -0.0467634 -0.0341356 -0.0901055 0.0585606 -0.0342665 -0.0779588 -0.0321424 0.1283232 0.0643561 -0.0617864 -0.0302318 -0.0126755 0.1040657 -0.0290151 -0.0121128 -0.0268331 0.1565398 0.1087359 0.0280801 0.0143551 -0.0082973 0.0585425 -0.0492804 0.0157827 -0.0447617 0.1449146 0.0471613 0.0107366 -0.094213 0.0236554 0.1023372 0.0357823 -0.134345 0.0326881 0.0728737 0.1401964 -0.0516581 0.0002696 -0.0541251 0.0347092 0.0876017 0.0121473 0.0850237 0.0850623 0.0785884 -0.0377615 0.0000212 -0.0590873 0.0428079 0.0962836 0.0042401 0.0904041 0.0864053 -0.0680778 0.0066545 -0.1155947 -0.0131359 0.1083146 0.054335 -0.1185339 0.0585744 0.0610543 0.4125536 0.0528501 -0.0635962 0.0988363 0.2633143 0.1547418 -0.0723709 0.1374849 0.2165847 unknown
polarizability: 278.6221793|7.1815058|134.8693849|10.5689242|3.6254892|89.5041693 unknown
InChI: InChI=1S/C12H9NO4/c14-10-3-7-12(8-4-10)17-11-5-1-9(2-6-11)13(15)16/h1-8,14H
charge 0 multiplicity 1
26 atoms
O  0.768458 -1.436721 -0.292555
O  5.559575 1.510006 0.027417
O  -5.481224 -0.28344 -0.089848
O  -4.712743 1.68794 0.768794
N  -4.52337 0.504973 0.278769
C  -0.506949 -0.875003 -0.146258
C  1.941661 -0.62941 -0.165075
C  -1.581704 -1.710372 -0.546796
C  -0.74816 0.412756 0.399983
C  -3.136529 0.02717 0.132535
C  -2.902643 -1.260301 -0.408124
C  -2.072516 0.863132 0.540274
C  2.17264 0.471109 -1.022196
C  2.915081 -1.048913 0.760963
C  3.390178 1.172178 -0.934361
C  4.139314 -0.350217 0.845186
C  4.371822 0.763071 0.000694
H  -1.35528 -2.697368 -0.959106
H  0.084881 1.043973 0.720552
H  -3.753002 -1.877517 -0.708529
H  -2.297105 1.845922 0.962838
H  1.417071 0.767089 -1.756855
H  2.714355 -1.915109 1.397696
H  3.600483 2.026149 -1.584073
H  4.901954 -0.674173 1.564291
H  6.192051 1.154975 0.700085
