program: Gaussian 09
title: 000152449
version: EM64L-G09RevD.01
frameworkgroup: C1[X(C6H6FNO)]
method: RPBEPBE
basis: SDD
operation: Freq
keyword: #p
keyword: freq=noraman
keyword: PBEPBE/SDD
title: #p freq=noraman PBEPBE/SDD
converged: YES YES NO NO
title: Mulliken charges:
elementType: F O N C C C C C C H H H H H H
charge: -0.193571 -0.432998 0.003516 0.379202 -0.418409 -0.439038 -0.440061 0.342598 -0.418570 0.247490 0.203535 0.272069 0.285866 0.265698 0.342671
chargesum: 0.00000
title: Mulliken charges with hydrogens summed into heavy atoms:
elementType: F O N C C C C C C
charge: -0.193571 -0.090327 0.003516 0.379202 0.032616 -0.166969 -0.154195 0.342598 -0.152871
polarizability: 9.54072124e+01 -9.93253322e-01 7.58245162e+01 2.65791509e+00 -1.28013305e+00 3.91268993e+01
1716.lowfreq: -11.6697 -3.9423 -0.0016 -0.0007 -0.0007 7.1174 43.3194 154.9271 219.9952
frequency: 43.3155 154.9264 219.9945 220.7776 317.4718 359.0905 427.9548 452.1705 515.3449 521.2342 603.3234 698.8024 714.4200 873.5657 892.0525 911.9051 930.1218 963.6721 1001.7881 1006.0772 1125.5424 1135.0320 1164.1365 1242.6028 1284.3334 1309.6184 1322.7955 1362.9221 1422.9885 1433.4774 1463.0843 1554.8669 1589.4115 2957.8859 3054.3043 3154.0995 3155.1248 3159.8404 3556.3905
redmass: 3.3283 4.1210 4.0213 3.7949 4.3007 1.4336 3.8410 4.2432 7.7074 4.0743 5.8443 5.1671 2.9290 1.5764 1.3832 5.0427 1.3962 1.7931 4.6908 4.2077 2.6513 1.6458 1.1277 2.5773 1.7511 1.5318 2.2092 1.2723 2.5712 2.5361 1.0894 6.4110 6.3964 1.0681 1.0941 1.0928 1.0904 1.0951 1.0663
irintensity: 4.5573 0.3963 5.7428 6.0882 17.0631 137.4449 36.9546 2.7418 8.7624 8.0318 1.3873 13.4642 23.3921 67.0339 4.3159 48.4334 0.2194 37.6151 7.9529 14.4485 11.0357 22.8788 15.9344 65.8314 5.0918 1.7072 8.0590 12.4241 86.1089 13.8950 5.6892 13.0664 25.0641 53.6259 12.5969 2.5963 9.8550 0.7531 8.7465
temp: 298.150 k
press: 1.00000 atm
elementType: 9 8 7 6 6 6 6 6 6 1 1 1 1 1 1
symmnumber: 1
zpe: 288757.4 jmol-1
zpe.correction: 0.109982 hartree
zpe.thermalcorrener: 0.117928 hartree
zpe.thermalcorrenthalpy: 0.118872 hartree
zpe.thermalcorrgfe: 0.076710 hartree
zpe.sumelectzpe: -461.368059 hartree
zpe.sumelectthermal: -461.360113 hartree
zpe.sumelectthermalent: -461.359168 hartree
zpe.sumelectthermalfe: -461.401330 hartree
dipole: 0.6604 -2.2349 -0.7345
dipole: 2.4434
quadrupole: -60.0045 -54.1918 -49.4447
quadrupole: -3.6315 -2.6291 -0.8636
quadrupole: -5.4575 0.3552 5.1023 -3.6315 -2.6291 -0.8636
hfenergy: -461.4780406 hartree
pointgroup: C01 [X(C6H6F1N1O1)]
dipole: -0.3311776 -0.9023861 -0.0120365 debye
dipolederiv: -0.8084517 0.4038009 0.1072108 0.4839941 -0.522285 -0.1024813 0.1211997 -0.0994579 -0.17998 -0.7649413 -0.1090518 0.217268 -0.1259986 -0.4497551 -0.143503 0.2841465 -0.1459844 -0.3536844 -0.1632577 -0.0034237 0.0043128 -0.0427623 -0.2776561 -0.0076468 0.0116559 -0.0090121 -0.2500632 0.0633527 0.0008617 0.0737339 0.1193654 -0.0896693 -0.02939 0.1508792 -0.0141593 -0.0348333 0.5365493 -0.008747 -0.1750465 0.0163971 0.379924 0.0760496 -0.2744671 0.0561328 0.3940836 -0.2023113 0.0816726 0.0326768 -0.0456876 0.0159683 0.0630784 -0.0095597 0.0789712 -0.112166 0.018928 -0.0615206 -0.0035094 -0.2388473 0.1149276 0.0495005 -0.1091964 0.0468954 -0.0880549 0.8071665 -0.4457724 -0.1104626 -0.6554361 0.5204909 0.0873884 -0.1946859 0.0916674 0.1834995 0.1214944 -0.0055478 0.012029 0.325086 -0.0216265 0.0391676 0.1202925 0.0218368 -0.0684448 -0.0257692 -0.0103134 -0.0534196 0.033621 0.0867798 0.0573732 -0.0116989 0.0220523 -0.0696902 -0.003041 0.0508907 0.0487514 -0.0251864 -0.2068673 -0.0494754 0.0373135 -0.0123114 0.0557976 0.1074255 -0.0361165 -0.014209 -0.0155887 -0.0054425 -0.0600731 -0.0015772 -0.0571282 0.1484125 0.016549 0.0595167 0.0075318 0.0770757 0.0707256 -0.0240299 0.0137871 -0.0269028 0.1413055 -0.052237 -0.0128478 -0.0172245 -0.0390726 0.1065004 -0.0208718 -0.0294927 -0.0212504 0.1487579 0.3485439 0.0965985 -0.129643 0.1330403 0.2779851 0.0649136 -0.1085966 0.0686505 0.0850603 unknown
polarizability: 95.5079046|-1.2854388|70.9022228|1.4413665|12.5373796|43.9485004 unknown
InChI: InChI=1S/C6H6FNO/c7-6-1-5(4-9)2-8-3-6/h1-3,9H,4H2
charge 0 multiplicity 1
15 atoms
F  2.669664 -1.340487 -0.433405
O  -3.232133 0.055419 0.384179
N  0.723076 1.652051 0.4845
C  -0.820343 -0.117869 -0.242298
C  -2.251275 -0.56409 -0.513732
C  0.271586 -0.990417 -0.470275
C  -0.538641 1.188275 0.240055
C  1.563022 -0.500229 -0.218049
C  1.77176 0.810155 0.253004
H  -2.574002 -0.239831 -1.518741
H  -2.314076 -1.67277 -0.480422
H  0.130656 -2.014476 -0.83229
H  -1.3581 1.886614 0.436237
H  2.781401 1.186293 0.447653
H  -3.015594 -0.185038 1.320984
