program: Gaussian 09
title: 000152442
version: EM64L-G09RevD.01
frameworkgroup: C1[X(C5H5N5OS)]
method: RPBEPBE
basis: SDD
operation: Freq
keyword: #p
keyword: freq=noraman
keyword: PBEPBE/SDD
title: #p freq=noraman PBEPBE/SDD
converged: NO NO NO NO
title: Mulliken charges:
elementType: S O N N N N N C C C C C H H H H H
charge: 0.297221 -0.244280 -0.410553 -0.069711 -0.050831 -0.624673 -0.560408 0.313727 -0.413408 0.167454 0.078521 -0.150993 0.322706 0.355565 0.311548 0.337474 0.340639
chargesum: 0.00000
title: Mulliken charges with hydrogens summed into heavy atoms:
elementType: S O N N N N N C C C C C
charge: 0.297221 -0.244280 -0.087847 -0.069711 -0.050831 0.042441 0.117705 0.313727 -0.413408 0.167454 0.078521 -0.150993
polarizability: 1.63029712e+02 -4.45327218e-01 1.26928306e+02 1.81224866e-02 7.17830693e-04 4.24458549e+01
1716.lowfreq: -0.0023 0.0015 0.0017 7.1194 9.7987 10.1745 88.9950 107.7538 181.3708
frequency: 88.9932 107.7458 181.3689 200.8754 223.7652 265.4455 287.4706 310.0315 346.7529 353.9062 413.7482 450.0936 452.2925 512.2867 556.7522 557.1785 581.0916 582.0608 609.8924 638.4751 655.1816 690.8458 728.6571 745.8149 918.1124 975.7002 1021.1840 1084.0626 1154.1249 1223.3370 1285.0297 1288.9070 1408.7682 1457.7097 1535.2573 1546.5480 1590.0499 1597.5543 1621.8999 1640.0498 3547.3012 3552.2420 3556.9351 3703.1014 3708.5181
redmass: 6.1029 6.3438 5.9410 6.0738 1.1993 6.6580 9.0228 4.5884 3.8947 1.1190 10.6844 7.9702 1.2362 1.1324 9.3466 1.1884 6.9375 5.4209 4.4378 8.8333 10.9988 9.4277 6.9330 11.8339 7.5571 2.0586 2.7728 4.2605 3.4563 4.5737 2.8598 2.2755 6.0878 8.7448 4.2803 3.3122 1.7040 7.9005 1.4806 2.6338 1.0744 1.0451 1.0490 1.1049 1.1054
irintensity: 6.8394 0.8082 0.9112 8.3492 52.9453 18.5317 0.2536 3.1371 1.5548 62.0041 0.7232 0.9763 211.0783 410.9024 8.4632 47.1761 2.9183 3.3868 5.5670 5.2704 0.9711 4.0577 15.2699 27.3825 50.7281 31.8266 9.7550 2.2106 9.3346 20.4276 88.2461 91.5030 45.8550 220.1625 232.7451 219.3425 57.0449 529.5572 622.7309 297.7337 36.7672 172.6233 92.1808 55.9293 44.6696
temp: 298.150 k
press: 1.00000 atm
elementType: 16 8 7 7 7 7 7 6 6 6 6 6 1 1 1 1 1
symmnumber: 1
zpe: 298809.9 jmol-1
zpe.correction: 0.113811 hartree
zpe.thermalcorrener: 0.124557 hartree
zpe.thermalcorrenthalpy: 0.125501 hartree
zpe.thermalcorrgfe: 0.077762 hartree
zpe.sumelectzpe: -939.735711 hartree
zpe.sumelectthermal: -939.724965 hartree
zpe.sumelectthermalent: -939.724020 hartree
zpe.sumelectthermalfe: -939.771759 hartree
dipole: -2.7195 -8.4992 0.0001
dipole: 8.9237
quadrupole: -44.5865 -81.4886 -79.4593
quadrupole: -14.2978 0.0133 -0.0040
quadrupole: 23.9250 -12.9771 -10.9479 -14.2978 0.0133 -0.0040
hfenergy: -939.8495213 hartree
pointgroup: C01 [X(C5H5N5O1S1)]
dipole: -1.4454714 3.199474 -0.0000338 debye
dipolederiv: -0.3052306 -0.0537855 0.0000433 0.1871752 -0.3369752 -0.0000661 0.0000915 -0.0001147 0.1297978 -0.5615712 0.0929754 -0.0000031 0.2296425 -1.2594716 0.0001364 0.0000311 -0.0001772 -0.383031 -1.0751571 -0.2627066 0.000192 0.0990469 -0.6276462 0.0000668 0.000122 0.0001551 -0.252669 -1.3816539 -0.0849602 0.0001397 -0.4015758 -0.600906 0.0000214 0.0002746 0.0000427 -0.2437301 -0.8972881 -0.3667527 0.0000534 -0.5937322 -1.3474525 0.0002317 0.000222 0.0001993 -0.3131367 -1.2042983 -0.6524366 0.0000586 -0.7256786 -0.6849713 -0.0001524 -0.0000321 -0.0001977 -0.7574302 -1.737162 0.2954582 0.0001499 0.3332983 -0.2754854 -0.0000754 -0.0002066 0.000011 -0.6883675 1.1367695 0.2171536 -0.0001514 -0.1180048 0.6489981 -0.0000945 -0.0002189 -0.0000777 0.1268651 -0.1622586 0.50683 0.0001164 0.558268 -0.5238541 -0.0000119 -0.0000909 0.0000527 -0.1552293 1.7288168 0.4327735 -0.0003181 0.6563417 1.5459995 -0.0002183 -0.0005085 -0.0002738 0.2472834 1.3258781 0.030643 -0.0001197 -0.2758588 1.7512515 -0.0001733 -0.0000793 -0.0000144 0.2494439 1.9423255 -0.231379 -0.000352 0.0191076 0.8651358 0.0001332 -0.0002391 0.0000813 0.0798928 0.1478058 0.01967 0.0000163 0.003798 0.1848408 -0.0000022 0.0000481 -0.0000528 0.3527078 0.3099357 0.0326293 0.000064 0.003739 0.1578317 0.0000761 0.0001643 0.0000996 0.39933 0.1893599 0.0441647 0.0000341 0.0594062 0.1600182 0.0001329 0.00019 0.0003003 0.4017138 0.3170641 0.0091185 0.0000338 0.0671303 0.1357604 -0.0000031 0.0001209 0.0000046 0.4041718 0.2266645 -0.0293957 0.0000429 -0.1021036 0.2069263 -0.0000013 0.0001109 -0.0000382 0.4023876 unknown
polarizability: 162.4559546|4.5368004|127.5020626|-0.0180856|-0.0013602|42.4458549 unknown
InChI: InChI=1S/C5H5N5OS/c6-4-8-2-1(3(11)10-4)12-5(7)9-2/h8H,6-7H2
charge 0 multiplicity 1
17 atoms
S  -1.873765 -1.453443 -0.000005
O  1.206003 -2.667169 -0.000187
N  0.813883 1.460228 -0.000159
N  -1.606127 1.242034 0.000125
N  2.197517 -0.520702 -0.000305
N  3.181037 1.600326 -0.000726
N  -3.874842 0.508956 0.000532
C  -0.337681 0.676106 0.000017
C  -0.2155 -0.713986 0.000109
C  2.055478 0.798047 -0.000273
C  1.072792 -1.40697 0.000107
C  -2.526372 0.26596 0.000361
H  0.715407 2.476926 -0.000093
H  4.075271 1.115433 -0.000962
H  3.152468 2.615733 -0.001376
H  -4.558431 -0.242312 0.000787
H  -4.186438 1.478232 0.000747
