program: Gaussian 09
title: 000152435
version: EM64L-G09RevD.01
frameworkgroup: C1[X(C19H38O2)]
method: RPBEPBE
basis: SDD
operation: Freq
keyword: #pfreq=noraman
keyword: PBEPBE/SDD
title: #p freq=noraman PBEPBE/SDD
converged: YES YES NO NO
title: Mulliken charges:
elementType: O O C C C C C C C C C C C C C C C C C C C H H H H H H H H H H H H H H H H H H H H H H H H H H H H H H H H H H H H H H
charge: -0.417631 -0.236965 0.342120 -0.430239 -0.407143 -0.379789 -0.389719 -0.502028 -0.387163 -0.739156 -0.762036 -0.386212 -0.386906 -0.385570 -0.385143 -0.381766 -0.372958 0.163680 -0.353186 -0.356822 -0.696699 0.203054 0.195737 0.198295 0.212976 0.192384 0.193664 0.195064 0.192883 0.243007 0.224670 0.193237 0.194737 0.206754 0.206108 0.253276 0.231473 0.220967 0.212011 0.194526 0.193084 0.193086 0.194146 0.193926 0.192800 0.193281 0.192482 0.192156 0.191336 0.189518 0.188968 0.187305 0.187711 0.194649 0.194739 0.209588 0.209624 0.214868 0.373238
chargesum: 0.00000
title: Mulliken charges with hydrogens summed into heavy atoms:
elementType: O O C C C C C C C C C C C C C C C C C C C
charge: -0.044393 -0.236965 0.342120 -0.031447 0.004128 0.006259 -0.001772 -0.034351 0.000810 -0.073018 -0.097585 0.001398 0.000327 0.001156 0.000619 0.001726 0.005528 0.163680 0.021831 0.032566 -0.062619
polarizability: 2.83289867e+02 4.96578447e-01 1.90669837e+02 -1.50226723e+00 6.16082022e+00 1.74739111e+02
1716.lowfreq: -5.3339 -0.0020 -0.0001 0.0010 3.3100 12.9402 15.2162 20.1914 27.6197
frequency: 14.2409 18.9106 26.6437 30.2822 33.6977 46.8845 49.4997 58.9667 71.2349 77.9542 88.8709 103.2821 107.5921 117.9788 122.3401 134.5750 142.5257 154.4206 156.3915 161.1210 175.3950 216.4369 223.7389 232.5047 244.2946 268.9903 283.7474 294.4753 325.9316 349.2554 373.8674 392.8414 419.4421 430.8482 453.3406 484.6315 499.1551 517.1713 537.0362 618.2968 680.8906 718.6557 720.0206 722.0143 726.8453 737.1888 755.9850 763.7878 785.4525 821.0772 856.9503 867.2437 888.3708 889.8831 909.5624 918.7636 937.0704 947.0048 967.3968 975.6869 985.2254 995.0247 1003.2751 1013.0496 1025.2321 1032.0246 1035.9518 1048.0976 1060.0990 1067.0605 1077.7169 1079.1993 1080.9957 1081.5997 1084.7729 1090.8868 1123.0623 1151.7813 1180.0951 1193.5763 1196.0076 1203.0506 1211.3228 1218.5258 1228.4396 1238.0159 1248.7756 1253.3818 1267.1733 1269.4504 1277.2016 1278.3041 1282.9949 1285.2458 1290.5140 1292.9351 1293.9170 1298.0969 1299.8985 1306.5521 1314.0617 1327.5800 1331.8665 1345.9501 1352.5229 1353.8479 1355.1442 1357.6540 1358.1909 1382.9203 1389.0720 1400.1711 1448.0242 1453.9967 1458.1982 1458.4983 1460.5251 1461.0279 1462.9589 1464.2156 1466.5733 1467.8545 1472.0000 1472.1450 1476.4464 1477.3459 1480.4890 1483.4585 1485.1970 1487.3331 1488.9932 1490.1384 1657.6324 2946.7648 2948.2197 2948.3167 2949.3049 2949.6497 2950.8694 2951.0241 2953.2366 2956.4206 2960.1347 2963.7283 2967.6640 2968.1042 2971.4093 2973.4808 2977.8257 2980.4869 2982.2373 2985.0292 2988.9401 2993.4257 2996.8478 3002.4997 3010.3683 3013.8292 3019.0700 3027.4474 3034.9589 3040.9408 3044.4348 3063.5584 3067.8927 3068.2320 3069.9332 3080.6075 3087.8468 3095.8986 3501.6553
redmass: 4.3427 4.2654 2.4584 5.9478 2.3466 2.0973 3.1663 2.8024 3.5204 1.7785 2.8293 3.3942 1.6788 3.5693 3.2294 1.7591 2.4871 2.2525 2.0482 2.5547 3.5973 1.3934 2.0641 1.1281 2.9410 1.0983 3.0520 2.5996 3.2480 3.2281 2.6080 2.7343 2.5257 2.4013 2.9242 2.9904 2.9353 3.0483 3.0260 1.7000 2.3114 1.0598 1.0615 1.0728 1.0925 1.1224 1.1610 3.8817 1.2077 1.2576 2.5934 1.5932 1.9208 2.1529 1.3237 1.9422 1.4258 1.4660 1.5633 4.0290 4.1344 1.8193 1.4846 1.9573 3.3898 1.1066 2.7331 2.3836 2.5764 2.7810 2.1804 2.2598 2.2404 2.2090 1.3195 2.7324 2.8160 1.7725 1.9582 1.7911 1.2870 2.0112 1.7418 1.3390 1.5441 1.4201 1.3848 1.5160 1.4144 1.3407 1.0208 1.3862 1.0449 1.2292 1.0870 1.2845 1.1754 1.1161 1.1184 1.3271 1.3682 1.4867 1.4775 1.4710 1.7076 1.6033 1.5958 1.6324 1.5982 1.2012 1.2176 1.2056 1.0951 1.0889 1.0745 1.0742 1.0739 1.0709 1.0671 1.0701 1.0572 1.0782 1.0806 1.0624 1.0867 1.0425 1.0874 1.0750 1.0791 1.0939 1.0951 1.0568 7.9743 1.0589 1.0583 1.0584 1.0586 1.0588 1.0592 1.0591 1.0594 1.0593 1.0590 1.0585 1.0585 1.0587 1.0367 1.0365 1.0363 1.0958 1.0963 1.0972 1.0983 1.0989 1.1007 1.1027 1.1033 1.0616 1.1044 1.1049 1.1049 1.1046 1.1044 1.0991 1.1006 1.0993 1.0993 1.0993 1.0987 1.1004 1.0637
irintensity: 0.0543 0.1417 0.1207 1.0219 0.0575 0.2398 0.3115 0.0075 0.6053 0.0735 0.0288 0.1528 0.0039 0.0025 0.0895 0.0003 0.0678 0.0378 0.0096 0.0159 0.5337 0.0431 0.5190 0.0009 0.0623 0.0478 0.2659 0.2442 0.7603 0.0086 1.5113 0.9408 1.3432 0.9378 1.7034 1.2443 1.2533 0.9662 48.9597 68.8145 78.0084 15.9538 7.9593 5.5304 0.3406 1.9539 0.1058 3.1292 1.0007 0.2069 13.0284 10.5848 3.6856 3.6024 0.9144 2.3951 2.8239 1.2057 1.3763 0.6848 0.1167 2.0932 1.5267 15.8423 2.3103 6.7685 44.6447 71.5734 34.8449 0.1026 0.3464 4.1833 3.3685 0.1341 6.1316 20.0168 21.9955 64.6075 0.0651 3.0464 29.3152 3.7645 3.6144 0.5407 4.7464 0.7188 2.4858 7.0352 6.9181 1.7264 0.1840 4.9531 0.4052 0.1756 1.1614 2.1282 0.6650 0.8029 0.0643 22.6855 1.4634 38.1109 17.4159 1.7732 0.3407 0.2590 0.4497 0.2487 0.3455 25.7844 11.2045 20.9789 3.0869 1.0926 0.0779 0.0100 0.1355 0.0612 0.1210 0.0351 0.1845 0.1660 2.3840 3.9097 0.4097 12.3222 4.2288 8.2604 10.8621 4.9899 41.6418 19.6062 220.9170 9.1803 0.0049 1.7196 0.8960 2.1755 1.5821 4.0969 0.4690 6.8462 0.9075 109.0465 61.6766 255.1081 36.2085 56.1210 18.7156 0.1924 0.2481 0.3500 0.7684 2.9039 3.3562 0.6065 0.0693 8.2972 1.3755 1.8478 6.8108 37.3274 393.7902 41.7953 97.1956 46.1061 55.4461 29.5963 27.2317 16.8134 19.1046
temp: 298.150 k
press: 1.00000 atm
elementType: 8 8 6 6 6 6 6 6 6 6 6 6 6 6 6 6 6 6 6 6 6 1 1 1 1 1 1 1 1 1 1 1 1 1 1 1 1 1 1 1 1 1 1 1 1 1 1 1 1 1 1 1 1 1 1 1 1 1 1
symmnumber: 1
zpe: 1400417.5 jmol-1
zpe.correction: 0.533391 hartree
zpe.thermalcorrener: 0.561343 hartree
zpe.thermalcorrenthalpy: 0.562287 hartree
zpe.thermalcorrgfe: 0.469931 hartree
zpe.sumelectzpe: -895.532824 hartree
zpe.sumelectthermal: -895.504872 hartree
zpe.sumelectthermalent: -895.503928 hartree
zpe.sumelectthermalfe: -895.596284 hartree
dipole: -1.7575 0.0368 0.6622
dipole: 1.8785
quadrupole: -164.3347 -132.5518 -133.8268
quadrupole: 4.4804 8.6295 -0.6055
quadrupole: -20.7636 11.0193 9.7443 4.4804 8.6295 -0.6055
hfenergy: -896.0662153 hartree
pointgroup: C01 [X(C19H38O2)]
dipole: 0.6919885 -0.0089727 0.2593896 debye
polarizability: 283.2977188|0.2754442|190.3075675|1.2456264|-6.6046981|175.0935289 unknown
InChI: InChI=1S/C19H38O2/c1-4-5-6-7-8-9-10-11-12-13-14-15-16-19(2,3)17-18(20)21/h20H,4-17H2,1-3H3
charge 0 multiplicity 1
59 atoms
O  -7.48135 -2.54013 0.321232
O  -8.85912 -1.006614 -0.737656
C  -6.17745 0.648524 0.151935
C  -4.756658 1.215566 -0.176299
C  -3.536111 0.373346 0.260329
C  -2.195999 1.027284 -0.150306
C  -0.959302 0.210196 0.286411
C  -6.403095 -0.645205 -0.716905
C  0.380477 0.843412 -0.151874
C  -7.226106 1.727368 -0.229233
C  -6.302812 0.313626 1.661473
C  1.616071 0.025071 0.286132
C  2.956046 0.639936 -0.176764
C  4.190028 -0.180922 0.261133
C  5.529972 0.419928 -0.219867
C  6.762604 -0.40389 0.21636
C  8.10242 0.18765 -0.276784
C  -7.70118 -1.360691 -0.415992
C  9.334376 -0.63897 0.15612
C  10.673972 -0.051765 -0.344147
C  11.89861 -0.885475 0.091291
H  -4.680696 2.214513 0.302612
H  -4.696524 1.395166 -1.271153
H  -3.583756 -0.641659 -0.184299
H  -3.547592 0.234944 1.359724
H  -2.176263 1.160481 -1.252521
H  -2.135473 2.046571 0.285819
H  -0.966966 0.094795 1.390568
H  -1.03226 -0.815503 -0.132656
H  -5.572859 -1.351385 -0.556399
H  -6.420225 -0.3468 -1.781804
H  0.387972 0.953974 -1.256669
H  0.455013 1.870634 0.262918
H  -7.102334 2.045922 -1.28189
H  -7.104321 2.620385 0.41219
H  -8.256979 1.351455 -0.112584
H  -5.676123 -0.54985 1.946393
H  -7.348094 0.071517 1.928278
H  -5.99322 1.182429 2.272161
H  1.619124 -0.070703 1.392258
H  1.530667 -1.00728 -0.113851
H  2.952416 0.73279 -1.283209
H  3.043209 1.67306 0.220637
H  4.201549 -0.263039 1.368331
H  4.094783 -1.217566 -0.125304
H  5.627082 1.456661 0.165709
H  5.517518 0.501126 -1.327173
H  6.780512 -0.478142 1.324045
H  6.660233 -1.442817 -0.161991
H  8.206762 1.226082 0.102413
H  8.083229 0.262817 -1.384461
H  9.229003 -1.67872 -0.219232
H  9.358321 -0.710678 1.263923
H  10.648557 0.020403 -1.450849
H  10.779425 0.986598 0.031894
H  11.831263 -1.919897 -0.29594
H  11.964897 -0.945319 1.194244
H  12.842707 -0.446114 -0.280522
H  -8.360548 -2.968297 0.513508
