program: Gaussian 09
title: 000152434
version: EM64L-G09RevD.01
frameworkgroup: C1[X(C17H18N2O6)]
method: RPBEPBE
basis: SDD
operation: Freq
keyword: #p
keyword: freq=noraman
keyword: PBEPBE/SDD
title: #p freq=noraman PBEPBE/SDD
converged: YES YES NO NO
title: Mulliken charges:
elementType: O O O O O O N N C C C C C C C C C C C C C C C C C H H H H H H H H H H H H H H H H H H
charge: -0.294667 -0.294749 -0.277695 -0.277709 -0.214356 -0.214761 -0.399814 0.023726 -0.381921 0.123532 0.123902 0.570511 0.192497 0.192551 -0.399558 -0.363114 -0.818719 -0.818624 0.107333 0.107356 -0.374527 -0.373891 0.379689 -0.495453 -0.495496 0.296656 0.312620 0.245949 0.243094 0.239219 0.227734 0.326864 0.239394 0.326900 0.227501 0.281923 0.280770 0.241027 0.227214 0.244417 0.241075 0.244413 0.227187
chargesum: 0.00000
title: Mulliken charges with hydrogens summed into heavy atoms:
elementType: O O O O O O N N C C C C C C C C C C C C C C C C C
charge: -0.294667 -0.294749 -0.277695 -0.277709 -0.214356 -0.214761 -0.087194 0.023726 -0.085264 0.123532 0.123902 0.570511 0.192497 0.192551 -0.153610 -0.120020 -0.024903 -0.024828 0.107333 0.107356 -0.092604 -0.093121 0.379689 0.217204 0.217179
polarizability: 2.62529901e+02 5.53299663e-02 2.14344052e+02 3.30279764e+01 1.16099689e-01 2.30444881e+02
1716.lowfreq: -9.9898 -7.5521 -0.0006 -0.0004 -0.0003 2.4423 6.9650 7.2920 17.0477
frequency: -8.2275 3.4742 16.7922 28.5039 31.1978 47.6129 54.0438 68.2276 74.1965 77.5190 100.4312 102.0822 103.5545 110.0903 150.9157 158.7360 166.2686 183.4441 191.9966 271.7369 279.9375 282.3145 296.2356 318.0672 326.5966 335.4192 346.0129 366.6156 386.8610 404.8131 415.7972 445.9136 497.8086 505.7627 542.4788 561.8934 570.3473 588.3813 608.5189 623.5678 654.6665 660.2082 675.7552 708.3601 727.5744 734.2971 746.6145 761.6077 786.2301 800.2252 835.1156 842.2145 872.9485 900.4237 913.4952 958.0586 984.0780 991.2821 1007.9180 1015.5865 1037.5497 1049.9872 1050.4810 1051.7391 1093.3965 1097.5714 1106.3111 1113.4648 1113.5603 1125.0499 1141.7912 1147.1441 1181.1149 1190.0805 1205.8869 1223.2209 1253.9885 1276.0705 1300.8943 1309.2252 1316.2569 1319.7300 1365.0841 1393.7360 1396.8368 1406.9782 1421.3785 1422.1783 1426.5977 1433.3012 1449.3603 1449.6356 1450.3630 1464.4196 1464.6584 1476.5013 1482.0152 1494.0529 1494.3021 1587.8201 1596.4010 1599.7844 1603.3746 1638.9834 1660.5039 2972.0138 2972.6559 3002.7008 3002.8682 3046.6358 3047.0332 3070.4599 3104.0803 3104.1902 3129.2430 3129.4207 3144.1150 3144.2205 3145.2676 3157.8962 3179.6413 3182.7722 3542.6284
redmass: 1.0950 1.0538 4.2719 5.0631 7.2412 4.4169 5.1610 6.5171 4.5168 3.1489 1.9387 1.2556 1.6772 4.5224 4.0909 3.8936 5.6941 4.0967 4.5097 4.0037 6.3578 5.5559 4.3065 7.6047 3.1848 4.8066 7.7689 5.3592 5.3555 2.8643 6.2618 6.7686 3.5903 7.6002 3.3516 4.7709 2.2127 3.9535 2.0030 6.2813 5.9147 5.9711 4.2170 7.9922 7.3600 6.0957 5.0186 6.3086 8.1984 3.4590 5.6392 1.2700 2.1389 4.6971 8.1022 1.6342 1.3619 1.3830 3.1587 5.2293 1.8945 1.5537 1.5111 7.1771 3.3659 3.9864 1.4583 1.2669 1.2647 3.1208 1.4618 1.5363 1.3250 3.6430 2.2649 5.8830 3.6960 1.5214 5.5639 2.2147 2.1836 1.5164 6.4518 1.2407 1.2529 6.6717 1.1887 1.1909 2.6872 1.3327 1.0503 1.0514 1.0915 1.0528 1.0532 2.3552 1.5765 1.0465 1.0468 7.3392 7.6244 8.3736 6.3364 4.1130 7.7511 1.0399 1.0400 1.0294 1.0294 1.0970 1.0970 1.0842 1.1043 1.1043 1.0963 1.0963 1.1047 1.1046 1.0896 1.0894 1.0948 1.0962 1.0772
irintensity: 0.0448 0.3985 0.0192 0.1831 0.6060 0.0845 4.8366 0.0008 2.7623 0.2337 1.1297 0.0913 0.3145 1.2441 11.8070 0.0093 2.1963 3.7035 6.5677 7.0409 0.5280 0.8338 0.6324 8.2990 8.6777 0.4179 14.8492 3.8943 5.7277 0.0063 7.1962 3.3141 2.1285 0.7921 1.0152 0.4869 24.0282 9.9471 28.9331 2.0643 17.9623 0.3110 34.7888 11.6381 3.3900 9.3476 0.1474 7.0462 40.1622 10.7633 7.7759 0.8801 27.8424 1.1135 10.9528 1.7359 3.9827 2.0582 4.0155 95.0582 36.3463 22.7902 2.8793 321.4251 14.2370 87.5251 3.5563 0.3561 0.5037 115.7481 63.1434 27.3546 67.6709 8.1168 157.3261 358.3313 173.5309 20.7773 31.1751 8.1019 66.3509 0.6320 99.0673 124.6713 30.6727 1.2754 59.0969 17.4821 41.9197 304.3374 0.3380 20.1818 22.7420 0.2400 21.7544 4.1767 129.0233 0.7562 36.3588 521.4663 1.4680 43.3965 41.5467 0.7971 247.2786 0.0427 68.7259 40.7112 41.1777 0.6434 32.2471 1.1662 0.6218 48.6590 5.0640 8.5910 5.3667 20.2186 9.1983 4.5401 0.3352 3.9149 49.2651
temp: 298.150 k
press: 1.00000 atm
elementType: 8 8 8 8 8 8 7 7 6 6 6 6 6 6 6 6 6 6 6 6 6 6 6 6 6 1 1 1 1 1 1 1 1 1 1 1 1 1 1 1 1 1 1
symmnumber: 1
zpe: 856415.3 jmol-1
zpe.correction: 0.326191 hartree
zpe.thermalcorrener: 0.351009 hartree
zpe.thermalcorrenthalpy: 0.351953 hartree
zpe.thermalcorrgfe: 0.266123 hartree
zpe.sumelectzpe: -1217.552438 hartree
zpe.sumelectthermal: -1217.527620 hartree
zpe.sumelectthermalent: -1217.526676 hartree
zpe.sumelectthermalfe: -1217.612506 hartree
dipole: -6.8117 0.0009 0.1568
dipole: 6.8135
quadrupole: -174.3069 -154.5032 -121.4990
quadrupole: -0.0077 21.4189 0.0381
quadrupole: -24.2039 -4.4002 28.6040 -0.0077 21.4189 0.0381
hfenergy: -1217.8786293 hartree
pointgroup: C01 [X(C17H18N2O6)]
dipole: -2.6791985 0.0009198 -0.0879151 debye
polarizability: 263.1729254|-0.0519645|214.3439131|-32.7077991|0.1177116|229.8019953 unknown
InChI: InChI=1S/C17H18N2O6/c1-9-13(16(20)24-3)15(14(10(2)18-9)17(21)25-4)11-5-7-12(8-6-11)19(22)23/h5-8,15,18H,1-4H3
charge 0 multiplicity 1
43 atoms
O  -0.863767 2.291602 -1.907066
O  -0.86734 -2.289848 -1.909305
O  -1.95228 3.702558 -0.416602
O  -1.953598 -3.700543 -0.416914
O  5.424976 -0.005664 -0.104636
O  4.893602 0.000593 2.113154
N  -2.794236 0.00072 1.791632
N  4.566565 -0.001955 0.862162
C  -1.111259 0.000979 -0.498677
C  -1.795185 1.276044 0.026563
C  -1.795515 -1.274225 0.026118
C  0.38853 0.00048 -0.137715
C  -2.5472 1.243672 1.187389
C  -2.547361 -1.242103 1.1870
C  1.373755 -0.002929 -1.157329
C  0.806722 0.003243 1.219851
C  -3.183928 2.40927 1.909897
C  -3.184012 -2.407984 1.909095
C  -1.581958 2.532964 -0.718118
C  -1.583106 -2.531118 -0.718824
C  2.745602 -0.003742 -0.842606
C  2.172086 0.002452 1.55881
C  3.126772 -0.001086 0.517414
C  -0.593391 3.489975 -2.730806
C  -0.59906 -3.488301 -2.733633
H  -1.174439 0.001164 -1.597176
H  -3.353508 0.000622 2.646375
H  1.049875 -0.004952 -2.202397
H  0.05748 0.006164 2.018523
H  -2.723074 2.537163 2.909308
H  -4.266926 2.234256 2.057685
H  -3.042198 3.338509 1.343113
H  -2.720827 -2.538306 2.907125
H  -3.044662 -3.336539 1.340575
H  -4.266378 -2.23171 2.059829
H  3.518376 -0.006327 -1.615744
H  2.512706 0.004543 2.597594
H  -1.539436 3.95844 -3.050909
H  -0.024632 3.114952 -3.593604
H  -0.005804 4.225369 -2.156102
H  -1.545883 -3.957219 -3.050726
H  -0.0094 -4.223322 -2.160569
H  -0.033085 -3.11326 -3.598257
