program: Gaussian 09
title: 000152428
version: EM64L-G09RevD.01
frameworkgroup: C1[X(C11H10N2O3)]
method: RPBEPBE
basis: SDD
operation: Freq
keyword: #p
keyword: freq=noraman
keyword: PBEPBE/SDD
title: #p freq=noraman PBEPBE/SDD
converged: YES YES NO NO
title: Mulliken charges:
elementType: O O O N N C C C C C C C C C C C H H H H H H H H H H
charge: -0.269584 -0.215289 -0.223334 -0.460631 -0.421634 0.305593 0.338728 -0.352235 0.249807 0.125053 -0.360134 0.154965 -0.363962 -0.265982 -0.225485 -0.536554 0.211228 0.330558 0.232839 0.349363 0.240815 0.230615 0.227774 0.239972 0.214643 0.242871
chargesum: 0.00000
title: Mulliken charges with hydrogens summed into heavy atoms:
elementType: O O O N N C C C C C C C C C C C
charge: -0.269584 -0.215289 -0.223334 -0.130073 -0.072271 0.305593 0.338728 -0.141007 0.249807 0.125053 -0.127294 0.154965 -0.123147 -0.035367 0.002289 0.160932
polarizability: 2.63489801e+02 9.98768177e+00 1.40742390e+02 -1.03971752e+01 5.95751484e+00 7.91956976e+01
1716.lowfreq: -7.6427 -5.5609 -0.0008 -0.0008 0.0004 7.6572 47.4178 50.4447 73.1193
frequency: 47.3810 50.4245 73.1075 107.5748 150.1012 161.7761 195.6446 209.7166 244.8855 260.9792 282.1443 329.7560 368.6683 408.0536 441.4531 483.0366 514.8665 528.8537 547.1296 557.9422 603.9843 623.8342 634.5594 706.2294 709.6266 728.6618 750.0123 755.1860 756.6953 779.3852 841.3914 857.6238 872.3941 936.6449 973.8074 978.0242 985.1974 1044.7297 1104.5229 1110.7960 1117.7017 1154.9557 1175.8146 1201.6491 1225.8417 1241.7935 1277.1762 1296.6551 1307.6002 1316.5604 1382.5514 1395.5471 1427.1494 1445.3005 1465.2174 1470.6527 1489.2701 1577.6444 1602.1306 1643.2284 1675.6711 1708.1816 2967.6958 3065.0038 3074.2348 3123.2468 3129.8895 3137.2532 3160.3296 3173.0790 3603.6380 3604.6954
redmass: 5.3130 7.8454 3.7546 3.4946 5.4033 7.1635 6.8514 1.5654 3.7983 3.2162 4.1305 3.1620 9.8064 5.1599 4.2133 3.5347 2.8444 1.4838 4.0936 4.1242 6.8789 10.2676 1.1105 4.7495 8.7721 4.6185 3.5093 1.8585 4.1526 4.1105 1.4655 2.0585 2.9820 1.3982 1.3299 3.4042 8.1226 2.2365 4.3294 1.2798 1.9263 1.3673 1.0964 1.8624 2.8743 2.6868 1.5677 3.8727 2.2456 2.1816 5.2396 1.9022 1.3742 1.8028 1.0894 1.0828 2.2499 6.8423 6.0883 8.8933 8.4759 8.4587 1.0334 1.1027 1.0874 1.0878 1.1004 1.0887 1.0939 1.0985 1.0789 1.0822
irintensity: 1.0197 0.9806 6.6402 1.5443 0.8042 4.6173 0.5576 0.9030 0.9900 2.4536 0.5054 4.5790 13.8084 2.0089 12.6837 0.9900 16.8715 45.9716 4.9654 8.0349 11.6623 44.9825 164.8351 3.1420 25.4470 5.7916 17.2467 32.1860 63.0797 36.7342 17.1010 15.1180 2.6518 3.4531 0.4072 57.5588 38.2434 9.2529 32.0569 0.7484 28.2184 1.2905 12.5989 95.5454 25.7108 87.0587 38.0504 236.6567 149.7743 64.8359 16.4942 14.2125 12.8995 12.1161 32.8294 29.1180 31.2893 17.7283 33.1113 148.5214 131.5845 799.2511 69.7198 30.9351 24.1442 6.9378 17.6159 6.7236 25.4106 23.0178 88.3603 49.1684
temp: 298.150 k
press: 1.00000 atm
elementType: 8 8 8 7 7 6 6 6 6 6 6 6 6 6 6 6 1 1 1 1 1 1 1 1 1 1
symmnumber: 1
zpe: 510531.2 jmol-1
zpe.correction: 0.194451 hartree
zpe.thermalcorrener: 0.208360 hartree
zpe.thermalcorrenthalpy: 0.209304 hartree
zpe.thermalcorrgfe: 0.153344 hartree
zpe.sumelectzpe: -759.215939 hartree
zpe.sumelectthermal: -759.202031 hartree
zpe.sumelectthermalent: -759.201087 hartree
zpe.sumelectthermalfe: -759.257046 hartree
dipole: -3.4138 -0.0332 -1.1796
dipole: 3.6120
quadrupole: -102.5815 -75.2590 -95.4448
quadrupole: -0.6157 1.0667 0.6774
quadrupole: -11.4864 15.8361 -4.3497 -0.6157 1.0667 0.6774
hfenergy: -759.4103905 hartree
pointgroup: C01 [X(C11H10N2O3)]
dipole: 1.3435511 -0.1476017 -0.4388255 debye
dipolederiv: -0.2237247 -0.3638959 0.0910525 0.1218742 -1.3146254 0.385613 -0.0040443 0.2975869 -0.3729195 -0.4574089 -0.0126173 -0.3141152 -0.0553634 -0.3060903 0.027273 0.0156368 0.0736741 -0.8571808 -1.8344277 -0.1739529 0.0029902 -0.1803877 -0.3989605 0.0317129 -0.1600518 0.0015729 -0.4914668 -1.5654353 -0.1976065 0.2698491 -0.2231694 -0.3984036 0.1043425 0.2000162 0.077259 -0.511045 -1.3588137 -0.0632547 -0.3699112 -0.0617347 -0.3812429 0.0091998 -0.2562505 0.0243187 -0.6271206 -0.2249496 0.0699267 0.0305113 -0.2750719 -0.2295015 0.0758972 -0.0574836 0.1287198 -0.0792713 0.7077955 0.0632955 0.1941347 -0.2250663 0.0282075 0.1533349 1.0663904 0.1466484 -0.3563223 0.4765379 -0.0036209 -0.1312708 0.0761347 -0.1111748 -0.1551937 0.2300877 -0.0821923 0.1032902 0.0733159 0.6193476 -0.2032281 0.027174 1.0000987 -0.2000006 0.0815025 -0.1173429 0.077671 1.5266309 0.1680487 0.298457 0.3730507 0.2976128 -0.093969 -0.7932881 -0.1482849 1.0351812 0.2787836 -0.016626 0.0737813 0.2164505 0.0683426 -0.1129817 -0.1240591 -0.1157152 -0.039067 2.4433264 0.2682429 0.0379746 0.3347478 0.3974042 -0.2428787 -0.0516599 -0.2156543 1.2556993 -0.0557063 -0.3332974 0.1577701 0.0113248 -0.2162467 -0.0111994 0.0246795 -0.1411454 -0.1174097 -0.3764067 0.0950456 -0.0204342 0.2712948 -0.0717975 -0.060893 -0.1510258 -0.025827 -0.1777775 0.0085474 0.0629807 0.0642451 -0.2147362 0.118485 -0.1286857 0.1930114 -0.1228215 -0.0329332 0.2874592 -0.2172053 0.063273 -0.1746492 0.674381 -0.1892139 0.0707183 -0.2778291 0.408036 0.0011082 -0.0077768 -0.0527567 0.0993749 0.1098922 0.0848592 -0.0770221 0.0775477 -0.0525383 0.148205 -0.0398896 0.032527 -0.0508882 0.3360784 0.0433707 0.0586607 0.0426195 0.1891623 0.0673682 0.0767745 -0.0842102 0.0418718 0.0050971 0.0950252 -0.0633972 0.0988812 0.0736413 0.1800303 -0.0144204 -0.0388603 -0.0080675 0.3544658 0.0198419 -0.0886164 0.0209927 0.2258345 0.0581253 0.0415704 -0.0428019 0.0706967 -0.0003347 0.1014262 -0.0714328 0.0914216 0.0958625 0.0022315 -0.1004724 0.021351 -0.1180216 -0.0241404 0.0859556 0.0257374 0.0858415 0.1217199 -0.1130137 -0.0353344 -0.0603389 -0.032837 0.1035984 0.0242656 -0.0866448 0.0250434 0.1193044 0.0624038 0.0530208 -0.0706887 -0.0267162 0.0017087 -0.093585 -0.0496875 0.0184707 -0.1009697 -0.1133088 0.205442 0.0239975 0.0651596 -0.0171901 0.0088345 0.0747038 0.0017539 0.0148109 0.0013264 -0.1437248 0.0267019 -0.0624449 -0.0256637 0.0376487 -0.0064807 0.0344607 0.0958083 unknown
polarizability: 259.241355|27.530562|114.761025|-2.9269243|-32.4871947|109.4255085 unknown
InChI: InChI=1S/C11H10N2O3/c1-16-9-5-3-2-4-7(9)6-8-10(14)13-11(15)12-8/h2-6,12-13H,1H3
charge 0 multiplicity 1
26 atoms
O  1.016013 -1.650371 0.074784
O  -0.658972 -0.288213 1.778868
O  -4.882457 -0.471034 -0.328918
N  -2.691632 0.064932 -1.118747
N  -2.899062 -0.513798 1.021681
C  1.142936 0.526517 -0.924594
C  -1.371532 0.10138 -0.596509
C  -0.272058 0.510803 -1.311152
C  1.783216 -0.518039 -0.177835
C  -1.513437 -0.259865 0.859065
C  1.947929 1.616147 -1.363189
C  -3.647282 -0.323655 -0.167752
C  3.144759 -0.398606 0.197144
C  3.30534 1.73054 -1.006481
C  3.896645 0.724749 -0.207353
C  1.545424 -2.651185 1.004935
H  -0.47915 0.925469 -2.310453
H  -2.947736 0.231798 -2.090072
H  1.475558 2.403376 -1.963549
H  -3.334449 -0.761421 1.909249
H  3.625544 -1.181885 0.789963
H  3.892132 2.592762 -1.33833
H  4.947854 0.805055 0.090832
H  1.765238 -2.193644 1.986641
H  2.450474 -3.141277 0.595829
H  0.740204 -3.392034 1.113242
