program: Gaussian 09
title: 000152419
version: EM64L-G09RevD.01
frameworkgroup: C1[X(C10H8N2O2)]
method: RPBEPBE
basis: SDD
operation: Freq
keyword: #p
keyword: freq=noraman
keyword: PBEPBE/SDD
title: #p freq=noraman PBEPBE/SDD
converged: YES YES NO NO
title: Mulliken charges:
elementType: O O N N C C C C C C C C C C H H H H H H H H
charge: -0.236814 -0.241082 -0.283734 -0.399500 0.471239 0.192937 -0.109566 -0.380953 -0.323189 -0.291107 0.149502 -0.214000 -0.215064 -0.237744 0.269183 0.254546 0.269372 0.362425 0.258015 0.234090 0.235346 0.236099
chargesum: 0.00000
title: Mulliken charges with hydrogens summed into heavy atoms:
elementType: O O N N C C C C C C C C C C
charge: -0.236814 -0.241082 -0.283734 -0.037075 0.471239 0.192937 0.159617 -0.126407 -0.053817 -0.033092 0.149502 0.020090 0.020283 -0.001645
polarizability: 2.04311394e+02 -7.38885545e+00 1.15939774e+02 9.08160952e-01 7.23590714e+00 6.38087515e+01
1716.lowfreq: -8.8663 -4.5206 -0.0010 0.0002 0.0003 2.1834 49.9979 62.3535 102.7100
frequency: 49.9957 62.3465 102.7068 163.4188 176.1546 268.5165 289.7717 365.7267 379.8076 406.3676 432.1572 504.2268 522.4575 548.5682 606.4050 613.4740 683.1292 695.7686 698.2038 706.4987 747.0243 763.2112 775.8444 807.7970 838.1589 912.6355 943.1010 949.9299 969.9115 981.7860 989.4344 995.6494 1030.3464 1072.1429 1092.0351 1175.5826 1189.0610 1196.5375 1246.6636 1281.1593 1315.1663 1327.7639 1369.7571 1384.5184 1397.5857 1444.9191 1482.9652 1594.0388 1601.1639 1610.9100 1650.1526 1669.7842 3133.5416 3142.0814 3154.4884 3169.4377 3178.3275 3188.8566 3217.0748 3521.3753
redmass: 6.3274 4.8034 5.3839 7.7669 5.8742 7.0882 5.6421 6.3029 6.2490 2.8812 3.8841 3.7066 6.9678 7.6421 5.2785 6.0858 3.0939 1.9101 2.5216 5.0074 5.8230 1.7446 1.9171 1.8954 1.2502 1.4133 3.0503 1.3121 1.3769 6.6940 4.8283 1.4041 2.0210 2.1167 1.5763 1.0505 1.1725 3.1347 2.4705 2.1690 2.3859 1.5367 1.7127 7.7600 2.6848 2.3548 2.3318 6.0975 6.2624 6.2620 10.9067 5.9234 1.0858 1.0892 1.0941 1.0993 1.0909 1.0970 1.0979 1.0769
irintensity: 0.2532 1.2687 1.0507 4.2274 2.6938 6.9778 1.0092 9.0371 8.8655 0.6992 11.7372 7.4498 5.8820 26.6945 10.5801 1.1376 22.4256 49.4035 8.0414 0.9256 7.5169 12.2971 92.0584 108.0998 1.7149 1.3790 4.5400 0.7101 0.4663 1.2936 1.0649 0.1650 12.5741 4.6064 6.2486 0.0632 6.1009 35.2552 6.1147 173.5921 118.3362 41.4422 22.8792 2.9558 58.9510 5.8647 77.7816 9.2162 6.5867 45.0839 226.7811 848.8002 2.8674 5.0715 22.7030 20.5116 2.1641 1.5037 0.7635 60.2378
temp: 298.150 k
press: 1.00000 atm
elementType: 8 8 7 7 6 6 6 6 6 6 6 6 6 6 1 1 1 1 1 1 1 1
symmnumber: 1
zpe: 429385.3 jmol-1
zpe.correction: 0.163544 hartree
zpe.thermalcorrener: 0.174456 hartree
zpe.thermalcorrenthalpy: 0.175400 hartree
zpe.thermalcorrgfe: 0.126022 hartree
zpe.sumelectzpe: -644.866180 hartree
zpe.sumelectthermal: -644.855269 hartree
zpe.sumelectthermalent: -644.854325 hartree
zpe.sumelectthermalfe: -644.903702 hartree
dipole: -4.5389 -2.5580 0.9484
dipole: 5.2957
quadrupole: -90.6608 -77.0541 -81.4704
quadrupole: 3.3465 -0.6282 4.1695
quadrupole: -7.5990 6.0077 1.5914 3.3465 -0.6282 4.1695
hfenergy: -645.0297245 hartree
pointgroup: C01 [X(C10H8N2O2)]
dipole: -1.7843528 0.9942507 -0.4104699 debye
dipolederiv: -0.6547092 -0.2127748 0.0896173 -0.2256882 -1.0562488 0.2387329 0.0403224 0.2327788 -0.4219117 -1.5109484 -0.103541 -0.0039782 0.1172187 -0.4597019 0.0403557 -0.0762281 0.0278042 -0.3809635 -1.1070875 0.1998679 -0.0876646 -0.6110817 -0.9438594 0.2213285 0.1448943 0.2474024 -0.1939059 -1.1281787 -0.3764099 0.1153646 -0.4152208 -0.5953064 0.077598 0.1084246 0.0566297 -0.3668861 1.1129708 -0.0582934 0.00107 0.0664648 0.0169816 0.1007041 0.0236142 0.0493637 0.0722763 1.3187833 0.0722054 -0.0134776 0.0256218 1.5355216 -0.4328571 -0.0543473 -0.37662 0.4430829 0.9535476 0.2553488 -0.0404587 0.9171131 0.4166974 -0.1491869 -0.1100651 -0.1325887 0.0374668 -0.1614531 0.0572227 0.0308218 0.0691148 -0.0700813 0.0485648 0.0095209 0.0679818 -0.1011722 -0.1934373 -0.0791907 -0.030205 -0.1469949 0.0095604 0.0486189 0.0149441 -0.0006327 -0.0862389 -0.9735913 0.0225976 -0.0280492 0.3603068 -0.1878824 0.0030336 -0.1621215 -0.0232492 -0.2393484 1.9228168 0.2075975 -0.0073916 -0.1373252 0.8836963 -0.2151308 0.1208413 -0.187268 0.3392219 -0.0190571 -0.0663073 -0.0321603 -0.0819591 0.0307433 0.1065793 -0.0644345 0.1048255 -0.0875511 0.0307147 0.0972125 0.0471818 0.0721733 0.0486795 0.1050771 0.0557636 0.0903987 -0.0874259 0.0600659 -0.0053189 -0.0041551 0.0189885 -0.0859896 0.030761 0.0152412 0.0345073 -0.1381168 0.0757679 0.0811513 -0.034611 0.0648643 0.04074 0.0405875 -0.0342332 0.0271938 0.1327091 0.0349217 -0.0818358 -0.0477333 -0.079821 0.0406234 -0.0778154 -0.0686959 -0.0709972 0.108183 0.0889373 0.0597015 0.0366629 0.0619752 0.0520086 -0.0638522 0.0489463 -0.034433 0.1182389 0.1726727 -0.0364614 0.0036598 -0.0712465 0.1948457 0.041879 0.0141437 0.0352925 0.3237933 0.0626851 -0.0354408 0.0101274 -0.0118393 0.0283567 0.0549206 -0.0204699 0.0563703 0.1690287 0.0222663 0.0646533 0.0362026 0.08343 -0.0065881 -0.0960325 0.0491184 -0.093027 0.1043872 0.0168031 -0.0656257 -0.0410507 -0.082427 -0.0016457 -0.0912079 -0.0526887 -0.084635 0.1067516 -0.1244906 0.0036411 0.0002272 0.0063324 0.1088492 -0.032658 -0.0024909 -0.0270979 0.148381 unknown
polarizability: 204.2885901|7.4977442|116.2632247|0.1256122|6.147417|63.5081042 unknown
InChI: InChI=1S/C10H8N2O2/c13-9-6-7-12(10(14)11-9)8-4-2-1-3-5-8/h1-7,11H
charge 0 multiplicity 1
22 atoms
O  0.501657 -2.142925 0.635241
O  4.459301 0.265783 0.044572
N  0.318563 0.116694 -0.068243
N  2.439445 -0.881391 0.312985
C  -1.134877 0.103709 -0.040341
C  1.047262 -1.055982 0.316726
C  0.991521 1.293208 -0.420999
C  -1.817049 1.180027 0.576659
C  -1.85708 -0.954518 -0.639199
C  2.357768 1.415508 -0.408347
C  3.197926 0.286963 -0.014554
C  -3.228556 1.207176 0.574636
C  -3.267761 -0.922862 -0.625006
C  -3.958104 0.15633 -0.025902
H  0.344179 2.114052 -0.738193
H  -1.251957 1.974582 1.07656
H  -1.323853 -1.791603 -1.095173
H  2.978415 -1.708047 0.592024
H  2.845388 2.343815 -0.7061
H  -3.75398 2.039287 1.055038
H  -3.827472 -1.743055 -1.086643
H  -5.053038 0.17405 -0.020841
