program: Gaussian 09
title: 000152398
version: EM64L-G09RevD.01
frameworkgroup: C1[X(C8H8S)]
method: RPBEPBE
basis: SDD
operation: Freq
keyword: #p
keyword: freq=noraman
keyword: PBEPBE/SDD
title: #p freq=noraman PBEPBE/SDD
converged: YES YES NO NO
title: Mulliken charges:
elementType: S C C C C C C C C H H H H H H H H
charge: -0.024916 0.489911 -0.354183 -0.371476 -0.210038 -0.242248 -0.234342 -0.180035 -0.568204 0.234953 0.226796 0.229974 0.231466 0.224737 0.115299 0.216691 0.215615
chargesum: 0.00000
title: Mulliken charges with hydrogens summed into heavy atoms:
elementType: S C C C C C C C C
charge: 0.090383 0.489911 -0.354183 -0.136523 0.016758 -0.012273 -0.002876 0.044702 -0.135899
polarizability: 1.37646351e+02 8.21688725e+00 1.30718188e+02 -1.03407168e+00 -3.27957234e+00 4.09626692e+01
1716.lowfreq: -11.6538 -0.0010 0.0013 0.0032 6.2382 9.2603 87.2697 131.4571 158.3937
frequency: 87.2688 131.4415 158.3879 198.1351 236.4777 286.3715 385.4757 419.9981 464.3015 500.2889 569.2194 645.8454 664.1693 742.2850 770.9571 778.7611 862.3008 888.2281 935.4382 943.7364 980.9676 1001.9510 1019.8450 1032.4391 1059.5888 1126.2143 1175.7759 1212.5855 1282.1524 1312.2787 1368.5525 1424.3977 1431.9280 1462.3797 1569.0368 1598.3091 1641.1006 2448.3373 3091.2845 3103.4405 3124.4831 3134.6526 3148.4539 3166.6868 3205.3193
redmass: 2.5836 3.2935 1.1713 3.5045 2.6855 3.9910 9.2074 2.4912 3.8347 3.6231 3.6476 2.1646 4.7319 1.5668 2.8560 2.2810 1.4301 1.1817 1.3490 1.3868 1.3344 1.1587 2.2070 3.7114 1.7449 1.8127 1.0583 1.8673 1.6155 1.2772 5.8967 2.2062 1.3691 2.1794 6.0290 6.2887 4.3967 1.0382 1.0768 1.0744 1.0865 1.0879 1.0941 1.1009 1.1142
irintensity: 0.1689 2.7497 24.6527 3.4701 1.8534 1.8054 1.7040 9.2711 2.5339 0.9137 4.4184 0.0289 12.9461 44.3701 25.2076 30.7244 0.9507 14.3923 71.9782 6.2873 0.1051 19.8712 13.8539 31.1435 1.1343 2.5335 1.2173 11.0511 2.1923 0.3699 10.1254 27.3845 4.4985 24.6208 7.7961 7.9544 15.9138 20.1380 9.0639 4.8472 4.7557 2.8314 22.7699 23.4262 19.5041
temp: 298.150 k
press: 1.00000 atm
elementType: 16 6 6 6 6 6 6 6 6 1 1 1 1 1 1 1 1
symmnumber: 1
zpe: 339687.1 jmol-1
zpe.correction: 0.129380 hartree
zpe.thermalcorrener: 0.138085 hartree
zpe.thermalcorrenthalpy: 0.139029 hartree
zpe.thermalcorrgfe: 0.095563 hartree
zpe.sumelectzpe: -707.039663 hartree
zpe.sumelectthermal: -707.030958 hartree
zpe.sumelectthermalent: -707.030014 hartree
zpe.sumelectthermalfe: -707.073480 hartree
dipole: 1.4101 -0.0306 -0.2831
dipole: 1.4385
quadrupole: -55.1307 -51.6107 -66.8997
quadrupole: 3.1179 0.7147 -1.5590
quadrupole: 2.7497 6.2697 -9.0193 3.1179 0.7147 -1.5590
hfenergy: -707.1690429 hartree
pointgroup: C01 [X(C8H8S1)]
dipole: 0.5516625 0.0874508 0.0912728 debye
dipolederiv: 0.0937378 -0.3257466 0.0877318 -0.2744644 -0.4511604 -0.0088746 0.0559869 -0.0130582 -0.1458383 0.0671082 -0.0824505 0.0178563 -0.2048724 -0.2590072 0.0457529 0.0862681 0.0385515 0.0549794 0.0371459 0.4539698 -0.0450986 0.4082085 0.8373187 -0.045122 -0.0383026 -0.0742854 -0.1090333 0.0096 0.0269791 -0.0254163 0.0039154 0.0686697 0.0139662 -0.0478589 0.0079576 -0.1480281 -0.1175189 -0.2785373 0.0073615 -0.1802341 -0.162959 0.0182762 -0.0016657 -0.0032491 -0.1330249 -0.1058248 0.085242 -0.0123785 0.1295036 -0.0171617 -0.0078153 0.0028096 -0.0141002 -0.1645841 0.0384076 -0.0001634 -0.0140778 -0.0439222 0.1086627 -0.0158596 -0.0157044 -0.0101519 -0.1479584 0.2745353 -0.1171397 -0.0206608 0.0810564 0.0374711 -0.1092478 -0.0906179 -0.0803882 -0.0936841 -0.1433099 0.1392165 -0.0935526 0.1585668 -0.1190388 -0.1670798 -0.1109708 -0.1404501 -0.3030649 0.0468201 0.0919746 0.0115422 0.0527633 -0.0610253 -0.0035946 0.0115662 0.0024649 0.1444375 0.0546278 0.0397232 0.006094 0.0865604 -0.0904023 0.0050418 -0.0007614 0.0081673 0.1544695 0.0121036 -0.0889606 0.0135689 -0.1080331 -0.0590757 0.0148054 0.0153988 0.008047 0.1635103 -0.1249261 0.0022842 0.0177399 0.010003 0.0775727 0.0026233 0.0188245 0.011849 0.1613046 0.0277512 -0.015331 0.0296578 -0.0871544 -0.0182779 0.0825627 0.0430102 0.0689461 0.117273 -0.1052831 0.1354881 -0.0701183 0.0139648 0.024002 0.0236786 -0.0218172 0.0577874 0.160816 -0.112753 0.0209586 0.0323147 0.0065095 0.0899463 0.0440133 0.0529305 0.0232808 0.164201 0.0477783 -0.0875067 0.0574357 -0.0523711 -0.0055349 0.1068734 0.0409041 0.1086317 0.1242247 unknown
polarizability: 139.5489059|-7.2582453|127.7828158|-0.3833906|-9.969027|41.995487 unknown
InChI: InChI=1S/C8H8S/c1-2-7-5-3-4-6-8(7)9/h2-6,9H,1H2
charge 0 multiplicity 1
17 atoms
S  -0.850047 -2.609412 0.106014
C  -0.507632 0.193852 -0.009939
C  0.16224 -1.067921 0.011967
C  0.296725 1.364989 -0.120158
C  1.572008 -1.141545 -0.084545
C  1.699181 1.296576 -0.214455
C  2.341466 0.035531 -0.192557
C  -1.980291 0.275475 0.103445
C  -2.764381 1.317446 -0.288445
H  -0.198685 2.341812 -0.100336
H  2.074374 -2.115911 -0.080818
H  2.290529 2.215198 -0.290124
H  3.432603 -0.034197 -0.258321
H  -2.472906 -0.601492 0.548504
H  0.205471 -3.44832 0.418698
H  -3.84919 1.290318 -0.143102
H  -2.358765 2.209903 -0.779427
