program: Gaussian 09
title: 000152392
version: EM64L-G09RevD.01
frameworkgroup: C1[X(C9H11O5P)]
method: RPBEPBE
basis: SDD
operation: Freq
keyword: #p
keyword: freq=noraman
keyword: PBEPBE/SDD
title: #p freq=noraman PBEPBE/SDD
converged: YES YES NO NO
title: Mulliken charges:
elementType: P O O O O O C C C C C C C C C H H H H H H H H H H H
charge: 1.259531 -0.227058 -0.671381 -0.683009 -0.597181 -0.302457 -0.832942 0.472874 -0.495707 0.372023 -0.377224 -0.357051 -0.222320 -0.222331 -0.225951 0.306636 0.312662 0.233911 0.248246 0.234457 0.262027 0.231497 0.233704 0.234317 0.411985 0.400741
chargesum: 0.00000
title: Mulliken charges with hydrogens summed into heavy atoms:
elementType: P O O O O O C C C C C C C C C
charge: 1.259531 -0.227058 -0.259397 -0.282268 -0.597181 -0.302457 -0.213644 0.472874 -0.013550 0.372023 -0.142767 -0.095024 0.009177 0.011373 0.008366
polarizability: 1.58332256e+02 1.19383804e+01 1.26672445e+02 -1.63037217e+01 9.25351099e+00 1.10105250e+02
1716.lowfreq: -10.5457 -0.0021 -0.0017 -0.0011 3.9564 6.1924 15.6432 25.7239 36.5013
frequency: 15.3401 25.6283 36.4749 63.9792 75.3680 127.9177 163.9174 179.6042 213.8631 232.8237 248.1686 270.7596 318.4532 329.6615 344.4100 366.3050 402.9989 405.6978 487.6011 539.6011 556.9404 595.9492 616.5832 656.3485 675.4643 702.6473 719.4484 744.5871 774.8002 809.4075 817.9857 858.0202 879.1438 905.3776 937.8943 979.3190 984.0016 990.7648 1003.8654 1011.6338 1026.6924 1062.4107 1092.6358 1096.0419 1153.0161 1175.6461 1190.3043 1192.8219 1224.2742 1233.2412 1282.2090 1331.5272 1349.1160 1386.7938 1397.9171 1443.2130 1462.2295 1485.0604 1587.5717 1595.2758 1614.4601 3041.3729 3048.7060 3123.0929 3127.1387 3132.9480 3133.0412 3143.8576 3154.9777 3169.1236 3360.8722 3609.6385
redmass: 6.2005 6.9308 4.9723 6.1819 6.2778 5.0059 6.1129 2.1977 3.9029 5.4169 2.3389 4.6165 5.6946 3.8052 5.0262 3.7023 2.8150 3.0536 3.5802 3.1026 1.2604 5.1392 6.3080 5.8564 6.7946 1.9508 4.3799 3.5344 3.8522 4.8125 3.6288 1.2485 2.1210 3.9773 1.4810 1.8541 1.4311 5.6886 1.3389 1.4832 2.2176 2.8798 1.5160 1.3413 1.3992 1.0549 1.1797 1.4746 2.8135 1.1940 1.8294 1.2601 1.3880 8.2509 1.0982 2.1775 1.1366 2.3143 7.7437 6.1383 6.0528 1.0615 1.0585 1.0894 1.1060 1.1005 1.0877 1.0918 1.0965 1.1016 1.0651 1.0662
irintensity: 0.4808 1.5649 0.4672 0.1260 7.7963 0.5723 0.5643 70.0436 9.3518 2.7748 22.8604 26.5905 22.4952 8.5436 75.5647 57.0004 0.0536 2.6925 15.3475 43.8492 116.9432 11.3097 0.2379 19.5119 32.1472 29.2804 310.0254 46.4618 88.6925 38.6841 11.1941 0.0525 11.9598 47.4960 1.0186 8.8339 1.1744 0.6314 0.3422 20.6806 3.7720 143.7104 5.8538 468.9486 26.1770 0.0298 12.8887 29.5422 25.8291 12.3510 231.5091 1.1679 34.4174 1.4718 37.5741 10.3194 17.5151 5.5003 122.4026 3.7946 1.1134 2.8045 26.0971 2.4233 5.7637 0.8579 1.9227 13.2149 26.3161 16.2836 213.3129 71.1234
temp: 298.150 k
press: 1.00000 atm
elementType: 15 8 8 8 8 8 6 6 6 6 6 6 6 6 6 1 1 1 1 1 1 1 1 1 1 1
symmnumber: 1
zpe: 499416.9 jmol-1
zpe.correction: 0.190218 hartree
zpe.thermalcorrener: 0.205726 hartree
zpe.thermalcorrenthalpy: 0.206670 hartree
zpe.thermalcorrgfe: 0.144603 hartree
zpe.sumelectzpe: -1065.779287 hartree
zpe.sumelectthermal: -1065.763779 hartree
zpe.sumelectthermalent: -1065.762835 hartree
zpe.sumelectthermalfe: -1065.824902 hartree
dipole: 3.2466 -3.1202 -0.6936
dipole: 4.5560
quadrupole: -86.2959 -94.2952 -95.6197
quadrupole: 3.9561 1.8830 2.9139
quadrupole: 5.7744 -2.2250 -3.5494 3.9561 1.8830 2.9139
hfenergy: -1065.9695051 hartree
pointgroup: C01 [X(C9H11O5P1)]
dipole: -1.1177031 0.4137871 1.3388536 debye
dipolederiv: 1.9494416 0.1052355 -0.147907 0.1481025 1.5819643 -0.1821844 -0.3767889 -0.1658902 1.671967 -1.6705424 0.0767966 0.2743887 0.1148789 -0.4377925 -0.1502101 0.6078636 -0.088787 -0.5301287 -0.6529504 0.0603974 0.0105674 0.0019663 -0.9834227 0.1070332 0.111602 0.1124718 -0.7771889 -1.2143733 -0.1790674 0.0205098 -0.2265271 -0.685708 0.1065207 0.0198867 0.0904437 -0.4429737 -0.6958614 -0.0134993 0.0243208 0.014577 -0.583947 0.0351534 0.0712556 0.0353177 -0.7266098 -0.7747279 -0.0512793 0.1668494 0.3458466 -0.8346678 -0.1198631 0.2650036 -0.02591 -0.4178314 -0.5342592 -0.1162992 0.1500446 -0.1478472 -0.2930876 0.0478891 0.2464495 -0.0279574 -0.3064107 -0.0907472 -0.0298167 0.0293313 -0.0209936 -0.0289862 0.0858123 -0.0555127 -0.0014574 -0.1857216 1.0992446 0.070082 0.0855327 0.374488 0.2451767 -0.0439635 -0.0736173 -0.0010989 0.4801843 1.6583847 0.0011408 -0.5643037 -0.4553145 1.0111012 0.120757 -0.7006522 0.1279572 0.4247391 -0.0710711 0.0104062 0.0674884 -0.1041733 -0.0018996 0.0831404 0.0015103 0.1172594 -0.010993 -0.0435137 -0.1027356 0.0210788 -0.0243344 -0.0640649 0.0378339 0.057761 0.0002449 -0.0782841 -0.0016836 -0.1436305 0.0060156 -0.1558705 -0.0081221 0.0012913 -0.0085418 -0.0066613 -0.124432 -0.1518352 -0.0091335 0.0056336 0.0067837 0.0200732 0.1221982 0.0080183 0.1552044 0.0043021 -0.0043234 -0.0372421 0.124197 -0.0307965 -0.062723 0.0403396 0.114301 0.0398065 0.0199439 0.0880796 0.0627117 0.016749 0.0346469 0.0292316 0.0158994 0.0548731 -0.0122867 0.0871811 0.0805872 -0.0048349 -0.0134397 -0.0096238 0.1200633 0.0242622 -0.0256346 0.0131542 0.0289307 -0.0237929 0.0087008 0.0531105 -0.0270844 0.0437127 -0.1288855 0.0330073 -0.0385975 -0.0318331 -0.0350763 0.0428643 -0.058195 -0.0370547 -0.0311249 0.0917957 0.0062219 -0.0088847 0.0812127 0.1220309 0.0025543 -0.0424351 0.015408 0.0135958 -0.1071307 -0.0207154 -0.122078 0.0045854 0.0615289 0.1096412 -0.021921 0.1100554 0.0601731 -0.0118218 -0.0196987 -0.0032238 0.1020489 -0.0073767 0.1213118 -0.029172 0.1355607 0.0120051 -0.0184486 -0.0349004 -0.0227386 0.1102219 0.1055683 0.0268536 -0.0205746 0.0130718 0.0036217 -0.1181762 -0.0435381 -0.1178997 0.0217732 0.0008259 0.0159523 -0.1233975 0.0190167 0.1129118 -0.0264145 -0.1354163 -0.0284896 0.0129235 0.4484038 -0.0205818 -0.0954887 -0.1024601 0.377498 0.0407071 -0.1211613 0.0407844 0.4239599 0.3580391 -0.0065281 0.0610165 0.0076777 0.3844177 -0.053535 0.0184239 -0.0606834 0.1584334 unknown
polarizability: 162.835549|-9.8781066|112.4059115|8.1480032|13.7697359|119.8684904 unknown
InChI: InChI=1S/C9H11O5P/c10-9(7-15(11,12)13)14-6-8-4-2-1-3-5-8/h1-5,11-12H,6-7H2
charge 0 multiplicity 1
26 atoms
P  3.157696 0.408597 -1.214062
O  0.187455 0.805336 1.409431
O  3.543997 -1.231848 -0.85261
O  4.685485 1.181259 -1.005818
O  2.427473 0.688566 -2.597685
O  1.173424 -1.14033 0.593762
C  2.318526 1.029584 0.351795
C  -2.091167 -0.051463 0.830774
C  -1.019414 0.001138 1.891098
C  1.187172 0.110341 0.778397
C  -3.105465 0.939184 0.788673
C  -2.094634 -1.092152 -0.134232
C  -4.107188 0.894363 -0.205668
C  -3.094926 -1.135907 -1.129242
C  -4.102624 -0.1436 -1.166798
H  1.960025 2.057241 0.195297
H  3.102447 1.039557 1.129722
H  -1.331333 0.56987 2.779895
H  -0.652536 -1.000662 2.16982
H  -3.107267 1.745369 1.5326
H  -1.306981 -1.853249 -0.106454
H  -4.887614 1.662603 -0.231562
H  -3.088845 -1.93924 -1.873669
H  -4.878655 -0.178385 -1.939456
H  2.76422 -1.686953 -0.411198
H  5.246327 1.210981 -1.82131
