program: Gaussian 09
title: 000152387
version: EM64L-G09RevD.01
frameworkgroup: C1[X(C10H13ClN2O5)]
method: RPBEPBE
basis: SDD
operation: Freq
keyword: #p
keyword: freq=noraman
keyword: PBEPBE/SDD
title: #p freq=noraman PBEPBE/SDD
converged: YES YES NO NO
title: Mulliken charges:
elementType: Cl O O O O O N N C C C C C C C C C C H H H H H H H H H H H H H
charge: 0.199420 -0.255517 -0.428511 -0.444718 -0.248798 -0.217185 -0.196567 -0.529839 -0.129819 -0.000163 -0.547024 -0.044254 -0.377802 -0.239380 0.325813 0.218985 0.184798 -0.766956 0.288133 0.215600 0.240654 0.287343 0.288531 0.212046 0.218086 0.339532 0.342212 0.354488 0.218692 0.250105 0.242096
chargesum: 0.00000
title: Mulliken charges with hydrogens summed into heavy atoms:
elementType: Cl O O O O O N N C C C C C C C C C C
charge: 0.199420 -0.255517 -0.086300 -0.090229 -0.248798 -0.217185 -0.196567 -0.529839 0.085781 0.287971 -0.019027 0.244276 0.052330 0.100152 0.325813 0.218985 0.184798 -0.056064
polarizability: 1.90430392e+02 6.18553930e+00 1.72389847e+02 7.41572871e+00 -1.00334146e-02 8.87266429e+01
1716.lowfreq: -11.3391 -7.0201 -4.4396 -0.0018 -0.0017 0.0003 29.8558 42.9409 62.6056
frequency: 29.7709 42.9199 62.5777 89.7984 95.5384 112.5459 119.0582 127.2325 153.6265 198.0379 203.3772 211.8853 254.0664 274.6176 280.2034 293.0728 299.2151 311.5144 328.0332 333.4612 383.8357 432.9730 446.0070 459.3547 465.8824 503.1886 572.2664 655.8206 675.4892 699.0790 719.4832 729.6902 761.3052 793.3577 809.2726 856.4247 867.0133 939.6066 940.9017 958.2281 970.3729 984.3854 1006.6323 1039.3193 1045.5958 1053.1758 1060.2382 1070.5150 1079.1709 1093.3409 1160.5519 1176.0358 1182.9125 1199.8083 1231.0961 1249.6012 1252.5579 1268.7681 1287.6896 1307.6358 1333.4277 1337.0688 1349.8014 1381.8769 1387.2745 1403.0940 1417.1862 1450.5042 1451.1287 1467.1905 1471.3576 1595.0033 1629.0776 1648.1549 2940.7280 2974.1764 2986.8576 2995.4438 3036.8151 3064.6733 3068.0479 3097.3329 3097.6829 3109.1057 3151.2596 3569.1928 3576.0606
redmass: 4.9922 6.2259 7.0159 7.0135 4.5499 3.3936 2.2265 1.7223 4.3279 4.2743 4.0458 9.2414 5.4652 1.2611 2.9891 1.9196 1.8604 9.9712 5.4272 5.4571 6.2707 8.9081 3.4475 7.4690 3.2166 3.0518 4.4526 5.6746 4.8972 8.1738 7.9787 6.9333 4.6871 6.0611 3.8376 3.1462 4.0119 1.3855 2.4968 3.4132 4.6402 2.0004 1.8761 2.9191 2.6243 1.5513 3.9120 3.4533 2.7120 3.9236 1.2347 1.7345 2.4554 1.1849 1.2696 1.6912 1.3399 1.6609 1.4126 1.5830 1.6476 1.6362 1.3868 1.5664 2.1772 1.2486 1.4615 1.0450 1.0890 1.0789 1.0745 10.7445 12.0514 6.5860 1.0554 1.0853 1.0360 1.1052 1.0646 1.0884 1.0977 1.1005 1.0887 1.1015 1.0955 1.0663 1.0667
irintensity: 4.6155 0.8657 1.6132 5.1626 9.0584 1.7051 2.4416 3.0270 8.7300 6.9594 9.3985 3.7942 1.3302 127.2336 13.8253 64.9679 119.5567 3.9351 0.6323 24.2649 1.3599 4.3141 2.2922 4.9418 8.5758 36.5842 26.2683 2.9895 7.0759 4.5914 25.1978 25.4795 2.5516 6.6322 44.3789 2.5375 17.3680 24.0108 62.9984 8.0674 79.4247 18.3353 13.7621 93.4170 56.7868 2.3474 96.9428 11.1684 29.9692 22.0441 51.1321 25.5505 10.8665 24.5589 2.2224 35.6107 27.3037 200.9032 12.8244 16.9098 24.6842 25.1042 7.8585 3.5856 34.1457 10.2047 0.6817 14.2736 12.0933 8.2669 5.2164 517.2427 74.3018 273.5219 36.3914 53.0941 23.6872 67.1998 12.5665 7.7320 14.5659 11.3620 15.4074 12.5356 40.6385 9.1061 8.1607
temp: 298.150 k
press: 1.00000 atm
elementType: 17 8 8 8 8 8 7 7 6 6 6 6 6 6 6 6 6 6 1 1 1 1 1 1 1 1 1 1 1 1 1
symmnumber: 1
zpe: 605302.4 jmol-1
zpe.correction: 0.230548 hartree
zpe.thermalcorrener: 0.248624 hartree
zpe.thermalcorrenthalpy: 0.249568 hartree
zpe.thermalcorrgfe: 0.183804 hartree
zpe.sumelectzpe: -1333.128724 hartree
zpe.sumelectthermal: -1333.110647 hartree
zpe.sumelectthermalent: -1333.109703 hartree
zpe.sumelectthermalfe: -1333.175467 hartree
dipole: -5.9193 1.2413 3.7937
dipole: 7.1394
quadrupole: -127.5493 -103.7373 -109.7027
quadrupole: 0.4835 -15.6310 2.7589
quadrupole: -13.8862 9.9258 3.9604 0.4835 -15.6310 2.7589
hfenergy: -1333.3592712 hartree
pointgroup: C01 [X(C10H13Cl1N2O5)]
dipole: 2.4303083 -0.6778151 1.2344644 debye
polarizability: 188.8379488|7.3812899|171.2464993|-14.8604402|8.3598867|91.4624344 unknown
InChI: InChI=1S/C10H13ClN2O5/c1-5-3-12(10(17)13(11)9(5)16)8-2-6(15)7(4-14)18-8/h3,6-8,14-15H,2,4H2,1H3
charge 0 multiplicity 1
31 atoms
Cl -3.812136 1.72509 1.034737
O  1.944283 -0.092513 -1.074669
O  4.1321 1.798029 -0.194352
O  2.440746 -2.69441 -0.059959
O  -1.018633 2.461548 0.335743
O  -3.998121 -1.213228 0.665977
N  -0.254324 0.307634 -0.166905
N  -2.493308 0.604878 0.501514
C  3.255281 0.958219 0.629512
C  1.086558 0.930286 -0.512119
C  1.810852 1.509861 0.735077
C  3.075922 -0.361122 -0.145473
C  2.794087 -1.548747 0.7865
C  -0.493909 -1.056172 -0.321742
C  -1.246434 1.22687 0.231773
C  -1.717008 -1.629051 -0.058045
C  -2.842817 -0.79678 0.394379
C  -1.981215 -3.106821 -0.225473
H  0.891235 1.692412 -1.28368
H  3.702985 0.799464 1.632956
H  1.323117 1.152328 1.658597
H  1.768046 2.609932 0.74262
H  3.941723 -0.574653 -0.791182
H  1.967482 -1.31241 1.491105
H  3.714949 -1.750414 1.374141
H  0.365048 -1.63561 -0.674391
H  4.137453 2.72058 0.165865
H  2.423899 -3.518064 0.488639
H  -1.075522 -3.630304 -0.576064
H  -2.794849 -3.279819 -0.9527
H  -2.313092 -3.559312 0.726719
