program: Gaussian 09
title: 000152379
version: EM64L-G09RevD.01
frameworkgroup: C1[X(C5H9N5O5)]
method: RPBEPBE
basis: SDD
operation: Freq
keyword: #pfreq=noraman
keyword: PBEPBE/SDD
title: #p freq=noraman PBEPBE/SDD
converged: YES YES NO NO
title: Mulliken charges:
elementType: O O O O O N N N N N C C C C C H H H H H H H H H
charge: -0.251626 -0.247256 -0.212109 -0.256451 -0.172536 -0.145799 0.053832 -0.618415 -0.085784 0.048783 -0.411516 -0.297707 0.430900 0.335019 -0.769729 0.309186 0.255053 0.250811 0.247263 0.369042 0.393351 0.242767 0.287997 0.244922
chargesum: 0.00000
title: Mulliken charges with hydrogens summed into heavy atoms:
elementType: O O O O O N N N N N C C C C C
charge: -0.251626 -0.247256 -0.212109 -0.256451 -0.172536 -0.145799 0.053832 0.143978 -0.085784 0.048783 0.152723 0.200367 0.430900 0.335019 0.005958
polarizability: 1.64958580e+02 1.85593095e+01 1.20804729e+02 -1.08588081e+01 1.13942975e+01 7.11920208e+01
1716.lowfreq: -7.2501 -0.0012 -0.0011 -0.0008 5.5483 8.6372 39.3005 50.3658 56.1762
frequency: 39.2506 50.3369 56.1640 77.4754 88.0929 106.6745 116.3466 135.7127 170.7192 191.7433 257.8673 290.7598 312.4190 330.7372 346.3053 391.2680 402.0228 426.8764 504.1794 554.2946 572.9568 615.5599 639.0836 665.8406 673.6755 702.6353 737.4118 749.5396 772.9194 782.4078 805.1418 858.6279 933.0334 965.1960 998.4677 1027.4466 1050.7352 1074.4850 1088.6038 1119.5282 1182.2241 1187.0890 1254.5005 1300.4125 1347.0760 1362.2593 1365.0223 1386.8174 1389.4521 1427.7913 1443.3032 1454.3851 1463.1571 1472.9773 1483.8088 1590.5639 1657.4199 2996.1662 3030.4126 3039.5109 3093.9099 3120.8970 3133.9393 3138.5268 3382.1833 3593.8975
redmass: 4.9395 7.6855 10.5335 9.0370 6.8953 4.9239 5.9262 1.0543 8.2505 7.3775 9.1090 4.1359 3.8379 5.5690 6.7513 3.0931 4.4391 2.9056 3.7583 3.8297 3.4139 3.7857 10.1032 2.9065 3.1327 2.0751 5.3911 4.1123 4.5679 1.1969 9.1053 3.4775 3.8085 2.2666 1.9302 4.2848 1.6314 2.7718 9.0036 3.1536 3.3696 3.4799 1.1622 1.4341 3.2893 1.4026 1.4533 3.7207 1.2583 1.2219 1.1087 1.0552 1.0625 3.4198 1.5667 3.4356 9.6305 1.0402 1.0620 1.0627 1.0918 1.1034 1.1006 1.1024 1.0524 1.0985
irintensity: 0.8169 0.9329 0.3673 7.5805 3.6700 0.9794 5.6830 1.4269 12.1373 7.7351 1.5791 9.6854 1.8494 2.2892 1.2149 1.1624 7.7787 2.9815 8.9734 1.6087 5.4271 9.1458 3.9545 40.1755 28.3885 43.0164 16.0715 74.3565 7.0948 179.1431 262.9530 13.9796 154.9003 36.3136 12.9099 30.8564 26.5592 36.1705 217.5122 4.4142 41.2407 282.2751 6.9090 76.3381 296.7444 40.9601 101.9957 176.1123 59.6513 52.2243 22.2834 11.8767 13.9321 206.4838 29.0747 365.5575 166.2916 9.1193 5.6520 18.5065 3.1177 4.7762 0.5963 8.4171 91.9836 127.7378
temp: 298.150 k
press: 1.00000 atm
elementType: 8 8 8 8 8 7 7 7 7 7 6 6 6 6 6 1 1 1 1 1 1 1 1 1
symmnumber: 1
zpe: 442500.1 jmol-1
zpe.correction: 0.168539 hartree
zpe.thermalcorrener: 0.183819 hartree
zpe.thermalcorrenthalpy: 0.184763 hartree
zpe.thermalcorrgfe: 0.124742 hartree
zpe.sumelectzpe: -844.493773 hartree
zpe.sumelectthermal: -844.478493 hartree
zpe.sumelectthermalent: -844.477549 hartree
zpe.sumelectthermalfe: -844.537570 hartree
dipole: -3.4007 -0.1261 1.6526
dipole: 3.7831
quadrupole: -94.8555 -90.7591 -86.8222
quadrupole: -9.5010 6.0513 -0.1711
quadrupole: -4.0433 0.0532 3.9901 -9.5010 6.0513 -0.1711
hfenergy: -844.6623124 hartree
pointgroup: C01 [X(C5H9N5O5)]
dipole: 0.0449696 1.3006568 0.7221785 debye
dipolederiv: -0.4096417 -0.0551192 -0.0308886 -0.2754947 -1.2469058 -0.2144088 -0.0433761 -0.2412442 -0.57913 -0.3984115 -0.0696398 -0.1656334 -0.0354049 -0.57789 0.09944 -0.2188425 -0.2006094 -0.8926006 -0.3766343 0.8444042 0.0463754 0.1340727 -1.0593987 -0.1101837 -0.0967289 0.3092241 -0.1518172 -0.858604 0.1878121 -0.2618462 -0.0277535 -0.4944366 -0.0500064 -0.3882517 0.0891491 -0.3906172 -0.4346144 -0.0427531 -0.0980959 -0.0693565 -1.0225142 -0.1771234 -0.0796675 -0.1655245 -0.2662595 -0.4467104 0.128333 -0.1108508 0.5602312 -1.346865 0.0527254 0.0218569 -0.2335666 -0.1994652 0.0122932 -0.5412994 -0.0460367 -0.3522064 1.800162 0.2267106 -0.0873201 0.1777793 -0.0316154 -0.8451502 -0.2195931 -0.2330219 -0.125902 -0.6410173 -0.0903716 -0.2605746 -0.1893979 -0.7306952 -0.4407434 0.417312 -0.0484645 0.5080852 -1.7412571 -0.0923715 -0.0327704 -0.0501962 -0.2131618 1.1901464 -0.6649828 0.3861881 -0.2610748 2.002439 0.1778629 0.5532297 -0.1023204 0.3912651 0.2337662 -0.0556871 0.1083914 0.0699573 -0.0604767 -0.0591334 0.1460424 0.0250611 0.1827495 0.3556849 0.0577139 -0.0677397 0.1291931 0.6002519 -0.0192598 -0.1257282 -0.2578866 0.1755679 0.9944581 -0.1089507 0.4009532 -0.536252 1.7467972 0.0923733 0.3153301 0.3085889 0.5624524 0.3695739 0.0614461 0.2607472 0.1666618 1.4530981 0.0910666 0.3797485 0.4757686 1.1675696 -0.0745332 0.1506817 -0.0824895 0.0617431 -0.3388622 0.1521775 -0.0383524 0.0933233 -0.0579343 0.0693404 0.0063536 0.0170368 0.0177675 0.1176568 -0.0790664 0.0155345 -0.0651249 0.1066897 0.0422113 -0.0474894 -0.0296331 0.0153559 -0.0299754 0.110774 -0.0175317 0.0031851 0.0887625 -0.0333669 -0.000323 -0.0683004 -0.0507263 0.04665 -0.0092173 -0.0668082 0.1026072 0.0329589 0.0969462 -0.0300297 0.021941 0.0216444 -0.0430396 -0.0485536 0.064446 -0.0420902 -0.0000135 0.3587012 0.0441225 -0.0065845 0.0281071 0.2675799 -0.0148614 -0.005468 -0.0028741 0.360738 0.3383087 -0.0013917 -0.0259321 0.0500491 0.3221106 0.007838 -0.0072931 -0.0087147 0.3520147 0.125941 -0.0131399 0.0340404 0.0195683 0.09251 -0.0460369 0.0288909 0.0027345 -0.0764147 0.0823798 0.0752496 0.0358155 0.0326321 0.146137 0.0205498 0.0098104 0.0075028 0.0975632 0.0486589 -0.1230297 -0.0359715 -0.0808976 0.0072459 -0.0209238 -0.0661763 -0.0353744 0.0713932 unknown
polarizability: 107.6812615|-11.8322335|169.6050623|21.1369286|9.380247|79.6690054 unknown
InChI: InChI=1S/C5H9N5O5/c1-4(11)15-3-2-9(8-12)5(6)7-10(13)14/h2-3,6H2,1H3
charge 0 multiplicity 1
24 atoms
O  -2.016045 -0.364114 0.447013
O  -2.4243 -1.406775 -1.59762
O  -0.368764 3.72063 0.088876
O  3.05735 -1.435337 0.801248
O  1.603665 -2.833259 -0.262957
N  0.305185 1.574121 -0.116976
N  0.51174 2.869371 0.426549
N  2.274362 1.043222 1.088453
N  1.053167 -0.617539 -0.237809
N  1.953156 -1.666066 0.124152
C  -0.834789 1.27965 -1.013529
C  -2.132307 0.932663 -0.257467
C  1.280319 0.615875 0.274366
C  -2.141082 -1.50359 -0.383569
C  -1.86798 -2.768916 0.384556
H  -0.549848 0.452832 -1.679424
H  -1.0114 2.196797 -1.604546
H  -2.954587 0.882974 -0.993242
H  -2.362654 1.665132 0.530285
H  2.28029 2.015067 1.402086
H  2.988773 0.34408 1.332166
H  -2.009339 -2.622303 1.465673
H  -0.818141 -3.065335 0.198302
H  -2.518172 -3.577082 0.014213
