program: Gaussian 09
title: 000152373
version: EM64L-G09RevD.01
frameworkgroup: C1[X(C8H8N2O3)]
method: RPBEPBE
basis: SDD
operation: Freq
keyword: #pfreq=noraman
keyword: PBEPBE/SDD
title: #p freq=noraman PBEPBE/SDD
converged: YES YES NO NO
title: Mulliken charges:
elementType: O O O N N C C C C C C C C H H H H H H H H
charge: -0.247780 -0.233602 -0.187630 -0.332909 0.116063 0.466289 -0.324900 -0.343048 -0.209525 -0.209301 -0.233528 0.291596 -0.493692 0.253946 0.253153 0.233532 0.234212 0.234275 0.243861 0.243078 0.245909
chargesum: 0.00000
title: Mulliken charges with hydrogens summed into heavy atoms:
elementType: O O O N N C C C C C C C C
charge: -0.247780 -0.233602 -0.187630 -0.332909 0.116063 0.466289 -0.070954 -0.089895 0.024007 0.024912 0.000746 0.291596 0.239156
polarizability: 1.50316433e+02 -5.76239072e+00 1.13021255e+02 5.42716982e+00 9.47317309e+00 7.20087902e+01
1716.lowfreq: -7.5424 -2.3642 -0.0009 -0.0006 0.0002 3.2509 32.4144 44.2816 82.5374
frequency: 32.3615 44.2470 82.5364 95.8386 116.6271 169.3133 186.8185 215.8289 253.9579 282.9654 339.2801 401.8377 405.8266 426.4056 509.7356 554.0286 612.1307 689.8351 699.9840 706.8449 722.4566 768.6717 836.7011 859.4388 899.9960 939.0531 969.2508 990.4703 995.7160 1018.0914 1040.6900 1086.4203 1115.7202 1150.4219 1166.3917 1175.0727 1189.6908 1301.5554 1319.1347 1385.2922 1409.8580 1425.5692 1441.3829 1453.5216 1462.7018 1477.1160 1595.5937 1604.4025 1626.9555 3008.2141 3112.2570 3134.7644 3145.9729 3157.2844 3159.7966 3170.8402 3178.2875
redmass: 6.0082 4.3209 4.6831 1.5857 2.0791 4.9545 6.1030 10.6394 5.3790 5.6296 5.2303 2.9934 9.5036 7.1717 4.2707 7.3974 6.3454 2.1334 7.2920 7.6080 3.5556 2.3137 1.2848 6.5340 2.1035 2.8487 1.3925 6.1927 1.3275 3.4369 3.0996 1.5599 1.2540 1.4682 3.2362 1.0519 1.2452 5.8677 1.3605 9.9932 9.2300 1.2176 2.2985 1.0499 1.0547 2.3043 6.4691 6.1361 9.9387 1.0296 1.1051 1.0854 1.0893 1.1048 1.0939 1.0966 1.1008
irintensity: 1.8658 0.1566 3.3509 1.5919 0.6026 3.5862 4.0019 0.9352 11.4696 6.1876 18.1636 5.6369 38.8113 1.6081 3.6318 41.7994 0.8217 23.8059 5.1604 63.5732 66.1426 17.7654 5.7373 148.5125 36.7482 73.7649 0.3313 1.5007 0.6606 46.2065 59.3506 12.9646 0.0410 47.4184 226.3147 0.1472 26.8078 280.3587 14.0691 1.9052 217.8958 29.8494 5.0184 15.7378 16.3686 30.6304 3.9640 4.7314 161.2407 34.5127 23.4055 0.0058 9.3104 12.6608 23.8000 12.5940 4.8355
temp: 298.150 k
press: 1.00000 atm
elementType: 8 8 8 7 7 6 6 6 6 6 6 6 6 1 1 1 1 1 1 1 1
symmnumber: 1
zpe: 396688.6 jmol-1
zpe.correction: 0.151091 hartree
zpe.thermalcorrener: 0.163482 hartree
zpe.thermalcorrenthalpy: 0.164427 hartree
zpe.thermalcorrgfe: 0.110979 hartree
zpe.sumelectzpe: -643.800438 hartree
zpe.sumelectthermal: -643.788046 hartree
zpe.sumelectthermalent: -643.787102 hartree
zpe.sumelectthermalfe: -643.840549 hartree
dipole: -0.1056 -1.8008 0.4343
dipole: 1.8554
quadrupole: -54.1003 -83.7395 -71.8924
quadrupole: 1.8700 0.6557 7.9430
quadrupole: 15.8104 -13.8288 -1.9817 1.8700 0.6557 7.9430
hfenergy: -643.9515284 hartree
pointgroup: C01 [X(C8H8N2O3)]
dipole: 0.0277044 0.6892436 0.2388437 debye
dipolederiv: -1.7585042 -0.1651643 -0.078576 0.191643 -0.3592046 -0.0284112 0.0333471 -0.0270434 -0.291454 -0.7240022 -0.0716675 -0.022606 0.0157261 -0.8951658 -0.2186984 -0.0357891 -0.1955014 -0.3710667 -0.1903591 -0.8421624 -0.3391882 -0.0444796 -0.9121153 -0.2988512 0.0366266 -0.3061802 -0.2245044 -0.6554824 -0.0342863 -0.0008146 -0.486659 -1.2558072 -0.3921555 -0.12754 -0.40742 -0.2728184 -0.1344712 0.4081922 0.1578763 0.0469991 1.6565382 0.6616838 -0.0208242 0.6411179 0.2231496 0.5126635 -0.0997155 -0.0514459 -0.0880074 -0.0656587 -0.1474855 -0.0228893 -0.0659168 0.102964 -0.0257003 0.11445 -0.0436375 0.028914 -0.0152666 -0.0305181 0.0076893 -0.0345644 -0.0712609 -0.0703182 -0.0976348 0.0254426 -0.0572373 -0.0049946 -0.0664663 -0.0630779 -0.0123327 -0.0494021 -0.073419 -0.1033263 0.0443563 -0.0651715 0.0372369 -0.1240772 0.0367055 -0.0988715 -0.0737059 -0.0306183 0.1325142 -0.0896269 0.0893131 -0.0554411 -0.0927423 -0.1085066 -0.0645568 -0.0549972 0.0975377 -0.0403611 -0.0269953 -0.063486 -0.0386364 -0.0467924 -0.0090737 -0.0741615 -0.1055102 2.2916633 0.5370011 0.239577 0.1939099 1.3132803 0.3788576 0.075313 0.3159463 0.4312066 0.7405602 0.1384942 0.0510263 0.2593641 0.2877842 0.008525 0.0983672 0.00805 0.2762905 0.0339536 -0.0554189 0.0693064 -0.0492256 0.0782735 0.0661523 0.066404 0.0422702 0.085899 0.0787092 0.060244 -0.0290851 0.0659234 0.0221766 0.084376 -0.0145148 0.0446418 0.0803704 0.0511833 0.0610874 -0.0174918 0.0760089 -0.0139125 0.1101479 -0.0259055 0.1079097 0.0813678 -0.0029378 -0.045125 0.0796638 -0.062922 0.0549667 0.0956119 0.0825273 0.0891707 0.0692362 -0.1065851 0.0573241 0.0230916 0.0589932 0.1016342 0.0303215 0.0239454 0.0228256 0.1340813 0.0182281 0.0095765 -0.0408007 -0.1132573 -0.0380915 0.0920969 -0.0183346 0.0941298 0.0024202 -0.0732137 0.0480875 0.010406 0.1034511 0.0410957 -0.0240207 0.0277609 -0.024042 0.12022 0.0211126 -0.0121092 0.0395218 -0.0998004 0.0613079 -0.0575542 -0.0422306 -0.0554712 -0.092486 unknown
polarizability: 150.5449387|-4.5141143|114.2817983|-5.5326547|-5.4673421|70.5197405 unknown
InChI: InChI=1S/C8H8N2O3/c1-13-8(11)10(9-12)7-5-3-2-4-6-7/h2-6H,1H3
charge 0 multiplicity 1
21 atoms
O  2.976527 -0.060889 -0.026728
O  1.511027 1.689629 0.47367
O  0.174096 -2.528878 -0.923567
N  0.6859 -0.424604 -0.174417
N  1.124424 -1.748074 -0.654633
C  -0.705145 -0.040555 -0.070615
C  -1.189692 1.070649 -0.80087
C  -1.575153 -0.816791 0.730655
C  -2.554816 1.41405 -0.712466
C  -2.940988 -0.468659 0.804674
C  -3.433465 0.644703 0.085892
C  1.725025 0.507963 0.120304
C  4.105372 0.856731 0.271262
H  -0.503892 1.664324 -1.412056
H  -1.189081 -1.671913 1.292636
H  -2.931361 2.280232 -1.266699
H  -3.618276 -1.066277 1.423857
H  -4.493689 0.91251 0.148801
H  4.083211 1.72433 -0.408917
H  5.00131 0.243583 0.10579
H  4.047266 1.207536 1.314927
