program: Gaussian 09
title: 000152368
version: EM64L-G09RevD.01
frameworkgroup: C1[X(C2H4N2O)]
method: RPBEPBE
basis: SDD
operation: Freq
keyword: #pfreq=noraman
keyword: PBEPBE/SDD
title: #p freq=noraman PBEPBE/SDD
converged: NO NO NO NO
title: Mulliken charges:
elementType: O N N C C H H H H
charge: -0.265156 -0.296835 0.078790 0.009556 -0.558600 0.256322 0.315189 0.236774 0.223959
chargesum: 0.00000
title: Mulliken charges with hydrogens summed into heavy atoms:
elementType: O N N C C
charge: -0.265156 0.018355 0.078790 0.265878 -0.097867
polarizability: 8.82025869e+01 -3.72603540e+00 3.43512792e+01 2.93971748e-04 6.67281155e-05 1.62659007e+01
1716.lowfreq: -0.0008 0.0005 0.0008 7.4698 16.4963 57.3850 151.8944 223.7854 269.4804
frequency: 151.7942 223.7853 269.4637 476.6061 569.0148 667.3987 767.2180 896.2369 936.9814 987.4459 1034.6717 1232.2043 1281.9531 1300.4312 1395.4442 1458.6856 1649.6951 3114.6419 3166.1922 3232.9745 3350.8259
redmass: 4.8607 3.9194 3.1377 3.8558 4.1178 1.3888 1.3871 1.3563 1.6067 1.1304 4.4425 3.2822 1.4722 2.0179 1.8710 1.3783 4.3932 1.0621 1.0948 1.1139 1.0762
irintensity: 2.8134 10.6122 6.1609 2.1750 6.0221 25.1780 66.0658 124.8025 54.5655 49.2559 251.2143 4.1783 19.8793 52.0194 122.7006 25.4093 57.0645 3.0572 2.0869 9.3377 1.3687
temp: 298.150 k
press: 1.00000 atm
elementType: 8 7 7 6 6 1 1 1 1
symmnumber: 1
zpe: 168456.1 jmol-1
zpe.correction: 0.064162 hartree
zpe.thermalcorrener: 0.069480 hartree
zpe.thermalcorrenthalpy: 0.070424 hartree
zpe.thermalcorrgfe: 0.036140 hartree
zpe.sumelectzpe: -262.858301 hartree
zpe.sumelectthermal: -262.852982 hartree
zpe.sumelectthermalent: -262.852038 hartree
zpe.sumelectthermalfe: -262.886322 hartree
dipole: -3.6832 1.0364 0.0003
dipole: 3.8262
quadrupole: -34.9651 -26.2005 -31.0546
quadrupole: 0.5756 0.0004 -0.0001
quadrupole: -4.2250 4.5396 -0.3145 0.5756 0.0004 -0.0001
hfenergy: -262.9224621 hartree
pointgroup: C01[X(C2H4N2O1)]
dipole: 1.4487013 -0.4090704 -0.0001633 debye
dipolederiv: -1.3124342 0.1885735 0.000115 -0.7443533 -0.2834971 0.0000007 -0.0002358 -0.0000278 -0.2108685 -1.1783061 0.0200786 0.0000758 0.5086921 -0.0662383 0.0000391 0.0001694 0.0000574 -0.2403097 1.8738897 -0.2734112 -0.0001478 -0.0810069 0.1478655 0.0000718 -0.0000726 0.0000722 -0.0379028 0.7564069 0.0612351 -0.0000935 0.3363088 0.1836507 0.000092 0.0000928 0.0000949 -0.0143162 -0.3514021 0.0425567 0.0000053 0.0737308 0.0457659 0.000239 0.0000142 0.0002593 -0.4819199 0.0775094 0.0537601 0.0000392 -0.0328988 -0.0078313 -0.0000941 0.0000136 -0.0001011 0.1879052 0.0513168 0.0042426 0.0000134 0.0169789 0.034026 -0.0001209 0.0000221 -0.0001312 0.3686728 -0.0101826 -0.0704674 -0.0000109 -0.0695517 0.040178 -0.0000728 -0.0000213 -0.0000759 0.2051986 0.0932023 -0.0265681 0.0000034 -0.0078999 -0.0939195 -0.0001547 0.0000175 -0.0001477 0.2235405 unknown
polarizability: 88.1958342|-3.7745063|34.358028|-0.0064627|0.0079728|16.2659045 unknown
InChI: InChI=1S/C2H4N2O/c1-2-3-4-5/h2-3H,1H2
charge 0 multiplicity 1
9 atoms
O  -2.295247 -0.268413 0.000001
N  -0.064823 -0.287021 -0.000027
N  -1.23874 0.460035 0.000252
C  1.171736 0.379476 0.000131
C  2.381664 -0.241327 -0.000297
H  1.069238 1.469375 0.000671
H  -0.135299 -1.320729 -0.00038
H  3.296023 0.355903 -0.00011
H  2.492548 -1.331599 -0.00084
