program: Gaussian 09
title: 000152358
version: EM64L-G09RevD.01
frameworkgroup: C1[X(C20H25NO3)]
method: RPBEPBE
basis: SDD
operation: Freq
keyword: #p
keyword: freq=noraman
keyword: PBEPBE/SDD
title: #p freq=noraman PBEPBE/SDD
converged: YES YES NO NO
title: Mulliken charges:
elementType: O O O N C C C C C C C C C C C C C C C C C C C C H H H H H H H H H H H H H H H H H H H H H H H H H
charge: -0.236270 -0.436499 -0.487767 -0.181834 0.326514 -0.499582 -0.467081 -0.724515 -0.751281 -0.722831 0.478044 0.072350 0.308668 -0.463830 -0.387350 -0.413212 -0.381973 -0.227893 -0.247329 0.267146 -0.247672 -0.390083 0.120216 -0.419248 0.197408 0.213302 0.248746 0.230521 0.251770 0.205821 0.202447 0.240837 0.250119 0.208846 0.225822 0.214777 0.221029 0.234602 0.290647 0.336102 0.280686 0.223630 0.222559 0.224999 0.221695 0.222133 0.224218 0.362376 0.358217
chargesum: 0.00000
title: Mulliken charges with hydrogens summed into heavy atoms:
elementType: O O O N C C C C C C C C C C C C C C C C C C C C
charge: -0.236270 -0.074123 -0.129551 -0.181834 0.326514 -0.088872 0.012186 -0.064477 -0.051479 -0.061202 0.478044 0.072350 0.308668 -0.229227 -0.096703 -0.077110 -0.101287 -0.004262 -0.024769 0.267146 -0.022673 -0.168388 0.120216 0.027102
polarizability: 2.59276815e+02 -2.12895180e+01 2.35728244e+02 -1.54028740e+01 1.28562803e+01 2.05509075e+02
1716.lowfreq: -8.9828 -6.6517 -0.0006 0.0002 0.0006 4.7986 22.3126 29.8939 46.6747
frequency: 22.2148 29.8012 46.6678 49.8859 54.8022 68.9733 78.5792 93.6018 103.9229 122.9193 144.0878 184.2655 192.7636 207.2134 226.0697 234.1080 247.2833 258.6239 261.9414 293.3523 303.2496 307.8174 312.6940 330.6203 344.0637 363.1823 374.2456 398.6875 409.8060 429.1074 439.3148 442.8681 472.6991 479.5098 505.5464 514.0760 531.2325 563.4646 591.1006 597.4206 617.0149 632.6449 681.7937 709.0194 715.8471 747.2423 755.8002 775.9853 811.7634 819.1535 827.7395 864.1497 890.4967 902.5463 917.8880 926.6176 936.7631 943.2281 958.2369 970.4023 975.9975 981.6855 987.5779 989.6632 1008.5692 1016.7374 1020.8076 1026.4066 1032.7775 1044.0028 1058.5741 1082.5100 1093.0035 1118.0263 1150.3625 1157.2824 1170.3847 1188.5878 1197.9088 1200.6752 1204.2310 1212.0367 1226.7456 1235.0384 1241.0503 1251.1717 1258.7207 1279.6919 1304.9555 1324.2145 1347.3758 1358.4284 1371.2838 1383.2956 1387.2145 1388.3020 1405.4171 1406.5781 1425.4735 1437.4056 1442.0295 1458.7129 1464.2134 1466.5652 1469.2690 1477.8675 1485.0213 1485.9070 1488.1607 1492.5510 1503.5633 1549.3027 1592.9739 1605.6181 1612.3347 1613.8413 2878.7062 2911.3005 2942.8338 2975.8913 2980.7240 2985.6219 2986.1400 2991.9153 3047.3918 3069.2962 3070.1731 3077.3630 3082.7463 3088.2088 3101.4066 3111.4759 3113.7381 3120.7615 3134.0024 3143.8536 3159.3953 3161.6084 3173.9496 3580.3645 3586.3802
redmass: 5.5984 4.6066 4.4369 3.9997 2.9962 4.3676 3.6918 4.5438 6.2687 4.4222 4.7602 1.9149 1.7867 4.0565 3.0851 3.0370 1.2202 2.2766 1.1781 2.2212 2.0301 3.5531 1.7135 4.9243 2.1420 2.9952 2.4119 1.1578 2.8774 3.2857 3.1408 3.0723 3.0137 3.0300 4.3114 3.8325 4.6626 4.5696 3.6487 4.2405 6.2734 5.3522 4.2189 2.9277 2.3058 3.9361 1.8345 5.0022 1.5868 3.0132 2.9598 1.2657 4.2696 1.7016 1.6338 1.4944 2.1649 1.2306 2.0125 1.5005 1.4274 6.7464 1.3822 5.4902 1.4461 1.4297 1.5919 1.9666 1.4758 2.4439 2.4904 2.3562 1.6202 3.6216 1.2870 1.1890 1.0544 1.1332 1.6340 1.3487 1.2711 2.9339 2.4297 1.7069 1.9003 1.9651 2.3683 1.3701 2.2218 1.3094 1.2917 1.4553 1.2513 1.3474 3.4218 2.8061 2.2975 1.2396 3.6485 1.6983 1.2408 1.0660 1.0636 1.0939 1.0642 1.2299 1.0754 1.7027 2.3811 1.1688 1.0614 8.2265 5.9434 7.1149 6.0559 6.7875 1.0718 1.0633 1.0556 1.0351 1.0353 1.0921 1.1047 1.0362 1.0860 1.0994 1.0984 1.0992 1.0984 1.1000 1.1001 1.0868 1.0898 1.0863 1.0916 1.0963 1.1015 1.0941 1.0925 1.0660 1.0665
irintensity: 0.7537 0.5136 0.6796 0.1281 0.0971 1.0068 3.5318 0.7213 2.3248 0.9039 0.7504 9.1662 12.7633 2.1900 0.8186 5.8731 3.2072 8.3927 124.5997 3.8225 0.0792 1.4847 0.1203 0.7824 1.3587 0.6401 3.2070 139.6469 0.0519 2.2468 5.3774 0.3600 0.3386 3.3846 3.5927 7.8522 17.5472 14.4390 30.8832 4.8861 0.8014 12.9302 7.4127 28.1256 38.5552 11.3183 50.3257 55.5374 41.9188 4.5864 9.6926 0.2251 3.7036 0.1769 0.9788 19.5714 37.2614 1.0011 7.9197 10.7280 9.6931 58.1393 2.3898 0.4556 8.3192 3.7743 7.9431 7.0218 3.1756 4.0548 10.1497 150.3242 3.4934 15.7353 26.1523 25.3502 0.0806 1.2848 90.5784 28.8654 5.7390 18.3645 33.5812 8.4802 16.9516 32.7592 265.0055 55.3503 71.5551 7.7900 1.4603 2.3159 33.0575 20.6997 14.0709 10.2784 10.7175 30.3053 7.4450 17.7404 0.1080 0.2436 2.2331 5.6020 5.2697 4.1172 8.4812 8.0508 7.2234 13.8823 36.4857 188.6632 0.8177 27.1990 4.6964 62.8579 82.9329 51.3130 45.5006 27.4962 27.7471 18.3565 34.0537 19.2963 12.3618 18.5256 15.3545 44.0909 51.1301 46.3260 26.6593 8.0970 18.4714 3.2811 27.4852 11.5948 34.7129 4.3905 47.0339 46.7905 8.7505
temp: 298.150 k
press: 1.00000 atm
elementType: 8 8 8 7 6 6 6 6 6 6 6 6 6 6 6 6 6 6 6 6 6 6 6 6 1 1 1 1 1 1 1 1 1 1 1 1 1 1 1 1 1 1 1 1 1 1 1 1 1
symmnumber: 1
zpe: 1062699.4 jmol-1
zpe.correction: 0.404761 hartree
zpe.thermalcorrener: 0.429021 hartree
zpe.thermalcorrenthalpy: 0.429965 hartree
zpe.thermalcorrgfe: 0.350696 hartree
zpe.sumelectzpe: -1055.729589 hartree
zpe.sumelectthermal: -1055.705329 hartree
zpe.sumelectthermalent: -1055.704385 hartree
zpe.sumelectthermalfe: -1055.783654 hartree
dipole: -2.1570 2.1063 3.1900
dipole: 4.3892
quadrupole: -118.2795 -141.5573 -143.0473
quadrupole: -8.3491 -1.5184 -5.4414
quadrupole: 16.0152 -7.2626 -8.7526 -8.3491 -1.5184 -5.4414
hfenergy: -1056.1343502 hartree
pointgroup: C01 [X(C20H25N1O3)]
dipole: -0.4455227 1.1679052 1.1914464 debye
polarizability: 243.1259707|-23.8728483|252.6850147|-12.681273|14.370374|204.7031484 unknown
InChI: InChI=1S/C20H25NO3/c1-20(2,3)21(12-15-7-5-4-6-8-15)13-19(24)16-9-10-18(23)17(11-16)14-22/h4-11,22-23H,12-14H2,1-3H3
charge 0 multiplicity 1
49 atoms
O  -1.417466 -2.229445 -2.414414
O  -4.248293 2.684649 0.624149
O  -0.553017 1.757896 2.445433
N  1.011045 -1.504742 0.268761
C  0.69968 -2.630209 1.247193
C  2.453896 -1.105285 0.269406
C  0.538333 -1.698737 -1.125054
C  0.858465 -2.079724 2.691381
C  -0.77083 -3.088127 1.078998
C  1.626971 -3.867705 1.040409
C  2.714591 0.278871 -0.31798
C  -0.94865 -1.486396 -1.494567
C  -1.785086 -0.385105 -0.921048
C  3.596096 0.432269 -1.417371
C  2.121627 1.43718 0.249277
C  -1.387761 0.397786 0.197543
C  -3.042152 -0.125475 -1.532966
C  3.887074 1.713125 -1.942845
C  2.410416 2.716264 -0.274108
C  -2.215327 1.412535 0.711483
C  3.294215 2.861015 -1.370617
C  -3.875921 0.892912 -1.043471
C  -3.460117 1.655522 0.075243
C  -1.83625 2.246663 1.918092
H  3.08508 -1.84495 -0.280591
H  2.79866 -1.111647 1.317854
H  1.074555 -0.947524 -1.74318
H  0.806171 -2.694535 -1.547856
H  0.260541 -1.158632 2.810814
H  0.503724 -2.83179 3.419717
H  1.908339 -1.849299 2.948006
H  -0.959492 -3.544935 0.092091
H  -1.469999 -2.246998 1.219559
H  -0.997475 -3.852172 1.844476
H  2.687303 -3.622009 1.228927
H  1.34148 -4.675873 1.738388
H  1.540273 -4.266884 0.012456
H  4.06024 -0.457007 -1.863075
H  1.425702 1.340048 1.090682
H  -0.432719 0.176668 0.677747
H  -3.338854 -0.73813 -2.390161
H  4.569661 1.813065 -2.794545
H  1.94326 3.601928 0.172276
H  3.515216 3.855564 -1.774901
H  -4.843465 1.097163 -1.520701
H  -1.762771 3.315786 1.624673
H  -2.636111 2.170998 2.684872
H  -5.099036 2.783304 0.128983
H  -0.323924 2.265624 3.26246
