program: Gaussian 09
title: 000152357
version: EM64L-G09RevD.01
frameworkgroup: C1[X(C10H10O2)]
method: RPBEPBE
basis: SDD
operation: Freq
keyword: #pfreq=noraman
keyword: PBEPBE/SDD
title: #p freq=noraman PBEPBE/SDD
converged: NO YES NO NO
title: Mulliken charges:
elementType: O O C C C C C C C C C C H H H H H H H H H H
charge: -0.196472 -0.246546 -0.299327 -0.093783 -0.444563 0.237429 -0.319026 0.184844 -0.398263 -0.350257 -0.248288 -0.201564 0.266109 0.243904 0.229974 0.233123 0.221253 0.236667 0.238963 0.251890 0.225870 0.228065
chargesum: 0.00000
title: Mulliken charges with hydrogens summed into heavy atoms:
elementType: O O C C C C C C C C C C
charge: -0.196472 -0.246546 -0.033219 0.150122 0.018534 0.237429 0.138894 0.184844 -0.159300 -0.098367 -0.022419 0.026502
polarizability: 1.37014146e+02 -9.00701654e-02 1.05368222e+02 9.47496560e+00 -3.73154954e+00 7.01039955e+01
1716.lowfreq: -12.4679 -0.0009 -0.0009 -0.0008 10.9896 15.6325 67.4858 112.6324 201.3347
frequency: 67.2233 112.6289 201.3327 222.4573 288.5005 373.6378 429.7853 471.5163 525.9558 543.6263 558.6871 613.0747 636.2882 724.6808 750.4116 755.2355 783.7427 822.8812 835.5575 854.3464 871.6365 883.4410 904.2812 932.7097 934.5761 972.9888 1015.5821 1025.9530 1033.2034 1069.6788 1092.0371 1142.0511 1164.0707 1168.4611 1174.5443 1213.2940 1238.5566 1249.5483 1264.1389 1287.0680 1310.6798 1321.4846 1334.3271 1396.7849 1445.9767 1456.3524 1469.4523 1485.4408 1604.5772 1617.6178 3004.8453 3020.5614 3044.6923 3092.5432 3109.8486 3114.6385 3126.0133 3138.0768 3159.8714 3176.1616
redmass: 4.5608 3.6082 4.3359 2.4039 4.5592 3.5982 3.9488 3.8678 5.1724 4.8794 3.7648 7.4031 3.1468 3.9230 4.1557 1.3574 4.4814 4.8422 4.3380 1.5299 3.6439 2.4524 2.3557 1.5940 2.1644 1.3014 2.0932 4.1786 2.4322 1.8217 1.8933 1.3823 1.1178 1.2643 1.6866 1.5012 1.7269 1.7053 1.4603 1.5433 1.2633 1.3433 1.2951 6.8303 2.4989 1.1326 2.7069 1.0942 7.2794 7.7376 1.0659 1.0625 1.0850 1.1024 1.0947 1.0991 1.0871 1.0899 1.0958 1.0980
irintensity: 0.5219 2.0971 0.6954 5.5112 0.9589 1.5795 8.6886 9.2372 3.1651 5.1124 4.7482 3.3983 8.0154 2.1500 7.8938 83.3563 55.0133 35.1009 20.9688 19.6673 113.7037 17.8358 49.1578 4.0882 16.8546 0.0941 8.8693 67.3365 28.8992 2.0148 9.8165 5.6228 6.0731 2.8741 23.3152 4.2919 36.6510 9.9762 12.5565 2.5138 1.4102 2.2926 1.5924 9.3914 34.7343 15.9134 54.9619 6.1935 15.4448 17.7748 39.9894 23.0402 17.7837 19.4049 22.7857 46.2370 2.9852 14.2776 25.5824 10.2796
temp: 298.150 k
press: 1.00000 atm
elementType: 8 8 6 6 6 6 6 6 6 6 6 6 1 1 1 1 1 1 1 1 1 1
symmnumber: 1
zpe: 464386.4 jmol-1
zpe.correction: 0.176875 hartree
zpe.thermalcorrener: 0.185731 hartree
zpe.thermalcorrenthalpy: 0.186675 hartree
zpe.thermalcorrgfe: 0.142616 hartree
zpe.sumelectzpe: -536.631513 hartree
zpe.sumelectthermal: -536.622657 hartree
zpe.sumelectthermalent: -536.621713 hartree
zpe.sumelectthermalfe: -536.665772 hartree
dipole: 0.3521 3.2866 -0.2968
dipole: 3.3187
quadrupole: -67.5115 -69.4758 -68.4257
quadrupole: -6.0661 2.9246 0.0272
quadrupole: 0.9595 -1.0048 0.0453 -6.0661 2.9246 0.0272
hfenergy: -536.8083882 hartree
pointgroup: C01 [X(C10H10O2)]
dipole: 0.1182636 1.2861894 -0.191016 debye
dipolederiv: -0.7326367 0.0797612 0.1272663 0.0660227 -0.5084618 -0.0783596 0.3808301 -0.1383136 -0.6235636 -1.4820911 -0.2367722 -0.0247315 -0.2015158 -0.5243457 -0.0914232 -0.3120367 -0.0579773 -0.3094695 -0.0392375 -0.0728596 0.030965 0.0037293 -0.1289198 0.0546601 0.0290653 0.0044529 0.1393927 1.4037645 -0.1067132 -0.1577268 -0.3767905 0.3987744 0.0404694 -0.0554693 0.1088948 0.6389478 0.0687916 -0.0649172 0.0717652 -0.028385 0.0026122 -0.0108701 0.0635926 0.0485518 -0.0392015 0.0391855 0.0479337 0.0049372 -0.4072558 -0.2003624 -0.0686608 0.1716048 0.0163724 -0.1136073 0.2572456 -0.0012327 0.0548228 -0.0786365 0.3884816 0.1500865 -0.0778288 0.0593045 0.3807748 0.8461369 0.3974486 0.0831054 0.7749708 0.3417028 0.0748791 0.0696533 0.059535 0.0798156 0.1168731 -0.0316698 0.0881842 0.1016923 0.1009206 -0.0400573 0.0533976 -0.0686795 -0.0964683 -0.2742716 -0.1967234 0.0395465 -0.0166661 0.024593 -0.0424484 -0.0315584 -0.1011804 -0.1527504 -0.1405445 0.0977064 0.0127155 0.1260223 -0.107212 0.0152362 -0.0133118 0.0063468 -0.1988718 0.0779233 0.0661205 0.0603675 -0.0522973 0.1223951 -0.078824 0.0811439 -0.0422106 -0.1116081 0.0012441 0.0155816 -0.0173535 0.0264501 0.0700381 0.0493455 -0.0323148 0.0542434 -0.104743 -0.0346534 -0.0277541 -0.0455977 0.0040801 0.0242454 -0.0815874 -0.0517889 -0.0740222 -0.0584464 -0.1217681 0.1015027 -0.0749787 0.0713397 0.0427019 0.0363514 -0.0634915 0.0649693 -0.00341 0.0626308 -0.111934 -0.0423407 -0.0625832 -0.0497631 -0.0530749 -0.0327808 -0.0562821 0.0610785 -0.0019454 -0.0033957 -0.1571707 0.0323386 -0.0094231 -0.0012845 -0.0871047 -0.0060634 -0.0773843 -0.0963265 0.0429658 0.1150299 0.0381653 0.067517 -0.0363816 0.085218 -0.037751 0.0289888 0.0899051 0.0527984 -0.03363 0.0220329 -0.0803867 0.0621587 -0.0278835 0.062819 0.1225674 0.097096 0.0084777 -0.0237666 0.0273072 -0.0496948 0.057089 -0.030216 0.0539152 0.1534399 -0.0412921 -0.1052946 -0.0303634 -0.1156735 -0.0057451 0.0100299 -0.0328284 0.0109551 0.1582344 -0.0960296 0.0489701 -0.0810458 0.0456522 0.0803324 0.032666 -0.0858919 0.0321197 0.1262842 unknown
polarizability: 136.805611|1.0677124|104.8379853|10.1753286|-5.5898598|70.8427675 unknown
InChI: InChI=1S/C10H10O2/c1-2-4-9-7(3-1)8-5-6-11-10(8)12-9/h1-4,8,10H,5-6H2
charge 0 multiplicity 1
22 atoms
O  -2.660043 -0.756877 0.314938
O  -0.459977 -1.665601 -0.203337
C  -1.062461 0.635045 -0.889858
C  -1.620903 -0.82271 -0.67754
C  -1.959202 1.505803 0.047299
C  0.386758 0.518275 -0.443827
C  -2.438917 0.491146 1.10318
C  0.649677 -0.814055 -0.050644
C  1.407491 1.482007 -0.365153
C  1.906456 -1.230153 0.421678
C  2.687317 1.091015 0.107081
C  2.927602 -0.250712 0.494492
H  -1.148708 0.956779 -1.941255
H  -2.033418 -1.352893 -1.547071
H  -2.823218 1.902536 -0.514629
H  -1.400839 2.348998 0.486764
H  -1.677049 0.3087 1.885066
H  -3.404311 0.736341 1.57012
H  1.22338 2.519524 -0.667717
H  2.079679 -2.26804 0.719128
H  3.494705 1.828166 0.169509
H  3.920181 -0.540294 0.857176
