program: Gaussian 09
title: 000152321
version: EM64L-G09RevD.01
frameworkgroup: C1[X(C20H28O3)]
method: RPBEPBE
basis: SDD
operation: Freq
keyword: #pfreq=noraman
keyword: PBEPBE/SDD
title: #p freq=noraman PBEPBE/SDD
converged: YES YES NO NO
title: Mulliken charges:
elementType: O O O C C C C C C C C C C C C C C C C C C C C H H H H H H H H H H H H H H H H H H H H H H H H H H H H
charge: -0.178862 -0.301685 -0.242144 -0.122402 -0.095727 -0.147117 0.313594 0.252582 -0.538857 -0.526414 -0.484847 -0.544383 0.378887 -0.620814 0.041652 -0.510577 -0.497071 -0.796777 -0.814738 -0.561479 -0.044120 0.112961 -0.522020 0.233951 0.204503 0.221595 0.217400 0.229910 0.214800 0.227049 0.220999 0.214242 0.235159 0.217679 0.221858 0.276444 0.248724 0.247653 0.218252 0.217134 0.229023 0.242196 0.232984 0.222669 0.227732 0.235840 0.246566 0.242081 0.203563 0.274758 0.225597
chargesum: 0.00000
title: Mulliken charges with hydrogens summed into heavy atoms:
elementType: O O O C C C C C C C C C C C C C C C C C C C C
charge: -0.178862 -0.301685 -0.242144 0.111549 0.108775 0.074478 0.313594 0.252582 -0.091547 -0.084565 -0.049606 -0.091546 0.378887 -0.122513 0.041652 -0.014200 -0.061685 -0.092574 -0.128497 -0.072832 -0.044120 0.112961 0.181898
polarizability: 2.86088634e+02 -9.49572933e-01 2.06157347e+02 -1.09018470e+01 1.86268215e+00 1.64636217e+02
1716.lowfreq: -15.7052 -0.0008 -0.0008 -0.0007 1.1123 9.3634 29.5484 41.6514 58.2422
frequency: 29.2786 41.6161 58.2041 67.6971 72.6848 101.7237 127.4992 141.0419 159.3936 162.3986 178.8830 200.1765 204.3583 221.8030 234.7435 249.0270 263.1238 270.7218 284.6975 291.4791 309.7104 326.3966 351.4732 369.4946 376.1224 402.6227 412.1896 434.5340 456.0991 476.1614 499.5434 522.1636 529.9674 542.3480 561.3061 575.9146 593.2457 614.1897 652.4939 672.2191 700.6768 710.4834 770.2016 805.5233 820.6341 823.4795 828.4176 852.9392 886.5657 902.2831 921.8132 925.3838 939.5721 947.1528 962.8797 971.3003 987.4372 1004.4072 1008.8510 1012.5466 1029.4702 1034.7693 1049.8278 1068.6320 1079.4831 1088.6891 1093.8186 1107.4226 1115.1871 1118.2566 1128.0578 1135.5591 1140.2953 1159.5066 1169.6060 1177.4621 1192.8917 1194.8233 1198.1537 1207.7537 1230.7432 1241.2255 1247.5324 1255.9278 1265.1566 1275.1270 1284.1001 1290.3065 1299.3023 1305.2328 1314.4354 1323.3677 1326.4493 1329.2694 1333.5484 1344.8903 1352.2461 1356.9572 1369.5074 1384.6896 1388.3135 1420.2606 1425.9911 1443.6493 1451.6855 1460.9736 1462.0527 1466.4224 1467.4732 1472.5795 1472.7910 1478.0535 1484.9781 1488.0467 1488.2118 1492.0931 1571.9219 1583.6061 1654.2363 2900.5435 2915.3019 2949.6659 2958.9911 2968.8418 2972.2065 2976.0382 2980.0484 2981.3771 2984.0522 2987.3605 2991.3895 2998.2232 3004.1394 3030.8947 3040.7640 3047.0793 3052.1402 3057.1207 3057.3197 3071.7955 3074.2130 3077.2283 3079.1472 3081.4118 3086.2694 3089.5286 3129.0963
redmass: 4.5707 3.3779 2.8760 3.7977 2.7616 2.2519 4.0195 1.7935 1.3849 1.8180 2.9661 1.6621 1.8187 2.6135 2.7345 2.4202 2.5271 2.5714 2.8141 3.3363 3.1538 4.8096 3.6753 2.4247 2.8249 3.3269 4.2946 3.7484 3.6417 2.7284 3.8990 2.4487 2.6920 2.3594 3.1527 3.7381 3.5492 3.9185 3.9034 2.9685 3.4078 3.4762 3.0813 2.1551 1.7984 2.1108 2.0355 2.1791 2.2929 2.1595 1.7789 2.3667 2.1673 2.5728 2.2848 2.0997 2.1356 2.0412 2.3118 1.8213 2.0307 1.8688 2.4648 2.8645 2.4332 1.9607 2.3556 1.2455 2.1508 2.2164 1.7753 1.8465 1.6898 1.7072 2.1391 1.8435 1.6843 1.6688 1.5211 2.0531 2.0552 1.5241 1.3937 1.7424 1.4847 1.8537 1.3933 1.4803 1.6390 2.3352 1.4814 1.4478 1.3773 1.3287 1.4799 1.4348 1.4544 1.4736 1.5180 1.1873 1.1950 1.1778 1.0794 1.0792 1.0619 1.0751 1.0743 1.0842 1.0903 1.0872 1.0719 1.0573 1.0560 1.0731 1.0578 1.0651 9.4995 8.9524 12.0442 1.0810 1.0805 1.0695 1.0723 1.0712 1.0365 1.0644 1.0616 1.0599 1.0447 1.0383 1.0543 1.0595 1.0662 1.0995 1.0975 1.0983 1.1001 1.0984 1.0962 1.1017 1.0902 1.0990 1.0993 1.0992 1.0954 1.0986 1.1055
irintensity: 2.4882 0.1465 1.4082 6.8821 4.5488 1.1996 2.7540 2.5805 1.2249 1.3113 0.3394 1.0002 0.3193 1.7297 3.3674 0.1899 0.2598 1.1466 0.3619 4.5504 5.5940 2.6677 1.9065 0.9787 0.8426 0.6670 2.1520 0.6376 0.9813 0.6994 1.9501 0.3193 0.8438 1.3465 2.5585 2.6632 10.1730 6.7773 1.4985 4.8275 0.4542 8.0855 9.2891 1.1293 4.7626 2.8897 10.6558 4.9936 8.4766 7.3869 7.6752 5.1556 10.8504 9.0144 0.9002 14.1351 13.0476 11.8792 41.2600 3.9049 24.0777 29.7268 15.8110 39.9805 3.1644 26.4507 69.2524 8.2062 11.1896 9.2829 11.6014 10.3277 12.8146 38.8219 0.5786 2.1181 24.2938 0.7111 6.1348 41.1553 17.2104 26.1544 1.6971 3.5826 4.2922 4.5238 3.0730 2.3704 9.0226 48.8371 0.0616 4.9776 2.2784 2.1280 2.0742 7.3389 0.5731 1.2740 2.4502 21.4621 20.7618 43.1657 17.9310 19.4850 11.3058 21.3213 2.4912 11.1450 9.2004 11.4264 3.0735 6.0795 1.6506 8.3565 33.1858 11.5068 299.3130 36.7187 192.9931 10.4205 16.2661 12.8090 9.8808 29.5384 94.0111 28.1593 34.9994 17.6643 12.9296 3.8720 47.8749 32.3348 10.9305 48.3160 16.2141 61.8547 32.2180 11.5205 17.7402 36.4779 14.5499 43.7468 12.8581 28.0232 42.4981 27.6704 8.7726
temp: 298.150 k
press: 1.00000 atm
elementType: 8 8 8 6 6 6 6 6 6 6 6 6 6 6 6 6 6 6 6 6 6 6 6 1 1 1 1 1 1 1 1 1 1 1 1 1 1 1 1 1 1 1 1 1 1 1 1 1 1 1 1
symmnumber: 1
zpe: 1149351.1 jmol-1
zpe.correction: 0.437765 hartree
zpe.thermalcorrener: 0.460040 hartree
zpe.thermalcorrenthalpy: 0.460984 hartree
zpe.thermalcorrgfe: 0.387561 hartree
zpe.sumelectzpe: -1002.815883 hartree
zpe.sumelectthermal: -1002.793608 hartree
zpe.sumelectthermalent: -1002.792664 hartree
zpe.sumelectthermalfe: -1002.866086 hartree
dipole: -1.3813 1.2517 1.3166
dipole: 2.2821
quadrupole: -186.2331 -131.1991 -136.9795
quadrupole: -5.9910 -11.7538 -5.4142
quadrupole: -34.7625 20.2715 14.4910 -5.9910 -11.7538 -5.4142
hfenergy: -1003.2536477 hartree
pointgroup: C01 [X(C20H28O3)]
dipole: -0.5469666 -0.4676417 -0.536914 debye
polarizability: 285.392236|-2.0951808|206.162797|14.1236749|1.7959002|165.3271648 unknown
InChI: InChI=1S/C20H28O3/c1-19-11-9-16(21)18(23-3)15(19)5-4-12-13-6-7-17(22)20(13,2)10-8-14(12)19/h12-14H,4-11H2,1-3H3
charge 0 multiplicity 1
51 atoms
O  -5.520908 0.745617 1.104955
O  3.86726 -1.865746 -0.048647
O  5.296639 0.475788 0.770614
C  -1.036778 -0.593284 -0.539061
C  -0.304738 0.59592 0.168721
C  -2.430525 -0.748194 0.099488
C  -3.299281 0.53939 -0.018529
C  1.1674 0.843083 -0.369566
C  -1.164576 1.896168 0.18617
C  -2.601605 1.685983 0.738982
C  -0.200729 -1.883403 -0.405666
C  -3.382863 -1.892311 -0.342781
C  1.933079 -0.492987 -0.36308
C  1.232339 -1.699912 -0.954135
C  -4.642931 0.043183 0.549588
C  -4.734606 -1.483276 0.312814
C  1.870863 1.861542 0.576367
C  -3.619697 0.953951 -1.490816
C  1.159068 1.395586 -1.832077
C  3.391819 1.936605 0.365731
C  3.241755 -0.604385 0.073024
C  4.069432 0.573612 0.457651
C  4.657341 -2.360269 1.102186
H  -1.15583 -0.367806 -1.620069
H  -0.182822 0.276736 1.230829
H  -2.255754 -0.897424 1.192016
H  -1.227943 2.317025 -0.835474
H  -0.665567 2.662931 0.806589
H  -2.552477 1.431924 1.816925
H  -3.181472 2.624346 0.658012
H  -0.692027 -2.716251 -0.944684
H  -0.1516 -2.176046 0.664002
H  -3.040962 -2.88478 -0.002824
H  -3.47021 -1.933859 -1.444838
H  1.173164 -1.567444 -2.056391
H  1.846168 -2.598392 -0.781137
H  -4.876068 -1.970772 1.296908
H  -5.629667 -1.726639 -0.287657
H  1.668039 1.567105 1.626155
H  1.437279 2.867872 0.431982
H  -4.117415 0.146373 -2.057089
H  -4.297546 1.826359 -1.48291
H  -2.707122 1.234439 -2.043176
H  0.601885 0.734028 -2.517879
H  0.695986 2.397323 -1.873121
H  2.187963 1.482419 -2.224028
H  3.873142 2.607763 1.099461
H  3.628295 2.352687 -0.635103
H  4.032668 -2.393764 2.016422
H  5.539619 -1.723513 1.267596
H  4.954215 -3.381598 0.816952
