program: Gaussian 09
title: 000152315
version: EM64L-G09RevD.01
frameworkgroup: C1[X(C14H14ClNO)]
method: RPBEPBE
basis: SDD
operation: Freq
keyword: #p
keyword: freq=noraman
keyword: PBEPBE/SDD
title: #p freq=noraman PBEPBE/SDD
converged: YES YES NO NO
title: Mulliken charges:
elementType: Cl O N C C C C C C C C C C C C C C H H H H H H H H H H H H H H
charge: -0.040127 -0.296465 -0.592923 0.259379 0.297600 0.295578 -0.395718 -0.298944 -0.222888 -0.406794 -0.366936 -0.240643 -0.249951 -0.414002 -0.234557 -0.236214 -0.244435 0.251627 0.208681 0.233475 0.244641 0.276393 0.232910 0.256866 0.227000 0.211545 0.226301 0.228197 0.229570 0.274172 0.286660
chargesum: 0.00000
title: Mulliken charges with hydrogens summed into heavy atoms:
elementType: Cl O N C C C C C C C C C C C C C C
charge: -0.040127 -0.296465 -0.032091 0.259379 0.297600 0.295578 -0.144090 -0.298944 0.219269 -0.162153 -0.090542 -0.007733 0.006915 0.024543 -0.008256 -0.008016 -0.014865
polarizability: 2.33994751e+02 8.94571928e+00 1.76535477e+02 -3.50037974e+00 2.35614562e+01 1.06411773e+02
1716.lowfreq: -7.3499 -6.6929 -1.3339 -0.0010 0.0010 0.0018 16.1106 37.2539 44.7357
frequency: 16.0164 37.1251 44.7241 58.7588 83.7559 98.6913 114.9595 149.8996 161.4193 207.2660 226.9242 253.3360 272.2551 320.9219 340.3711 385.2616 404.0407 407.4473 464.9290 516.3768 548.8662 555.7656 572.5753 591.5264 616.7354 643.9734 702.9544 748.0012 762.3148 773.0756 791.1637 794.1365 808.2159 852.8969 897.6341 924.1498 925.8637 966.1926 967.8875 976.2326 988.5153 995.0521 1009.9865 1041.4300 1065.3805 1071.8199 1084.9037 1116.1762 1139.6063 1142.6483 1173.3833 1192.7112 1196.7988 1205.0274 1252.2355 1287.7578 1294.4329 1317.2563 1327.8414 1350.3523 1371.1828 1384.7721 1415.8849 1440.0826 1443.3957 1467.2963 1481.6207 1491.5155 1554.9062 1583.4600 1594.5833 1610.8029 1641.6275 2930.1847 2976.7030 3045.1042 3069.6214 3122.1324 3130.0672 3138.1224 3143.5812 3156.3755 3160.0166 3175.2488 3177.5599 3508.7131 3639.4878
redmass: 5.0089 2.0690 3.5482 4.5536 4.9515 3.5621 2.8577 2.4776 1.6034 5.2622 4.2215 6.4774 6.7115 5.2776 4.7854 8.0289 3.5656 3.2653 4.4871 1.3298 5.2812 3.6467 4.2045 6.6436 6.4032 7.4273 1.7900 2.8390 1.5949 6.0640 1.8512 1.1976 5.7099 1.2442 1.3596 1.5872 3.6116 1.4342 1.3372 1.3844 5.8333 1.3193 6.1196 2.2425 2.8700 2.4301 1.6204 2.7834 1.3805 1.6094 1.0529 1.3166 1.1965 2.6678 1.3515 2.3183 1.1049 1.4943 1.2816 6.5615 4.5009 1.5922 2.6092 2.3668 2.5076 1.0875 1.0901 2.5722 6.4703 6.0814 7.1393 6.0115 1.0953 1.0696 1.0584 1.0966 1.1023 1.0849 1.0883 1.0868 1.0937 1.0928 1.0987 1.0986 1.0965 1.0452 1.0997
irintensity: 1.3614 0.9579 0.0230 0.1150 1.5538 1.1140 3.7073 19.0548 34.8437 1.6471 2.1063 0.8124 3.5426 3.7196 3.2442 3.2419 9.0983 4.2999 1.5043 246.2429 3.5508 2.4879 8.0887 2.9748 0.3445 25.5594 53.5381 13.9983 98.8817 30.4617 14.2242 4.7386 4.7690 0.6576 0.5502 5.2358 84.3512 31.1471 4.4449 1.1495 0.4067 0.3935 5.3389 25.8147 3.8673 33.7301 4.9196 27.4705 9.4868 1.8632 0.0039 4.8035 5.7070 101.3001 1.2580 1.7035 4.2929 11.1646 6.6895 4.2069 4.5699 5.1502 62.8146 18.3755 38.5068 0.0372 8.2937 8.9439 15.2710 2.0264 2.5951 3.6949 39.9476 66.5930 33.9216 7.4580 52.0869 3.6067 4.7867 6.6867 26.7345 9.1264 33.9868 11.3326 5.4934 1.4003 4.7773
temp: 298.150 k
press: 1.00000 atm
elementType: 17 8 7 6 6 6 6 6 6 6 6 6 6 6 6 6 6 1 1 1 1 1 1 1 1 1 1 1 1 1 1
symmnumber: 1
zpe: 640552.4 jmol-1
zpe.correction: 0.243974 hartree
zpe.thermalcorrener: 0.260347 hartree
zpe.thermalcorrenthalpy: 0.261291 hartree
zpe.thermalcorrgfe: 0.197519 hartree
zpe.sumelectzpe: -1130.679278 hartree
zpe.sumelectthermal: -1130.662905 hartree
zpe.sumelectthermalent: -1130.661961 hartree
zpe.sumelectthermalfe: -1130.725733 hartree
dipole: 2.3852 0.2842 -1.0957
dipole: 2.6401
quadrupole: -101.8217 -88.6173 -109.1659
quadrupole: 6.3197 -0.6150 5.1521
quadrupole: -1.9534 11.2510 -9.2976 6.3197 -0.6150 5.1521
hfenergy: -1130.9232518 hartree
pointgroup: C01 [X(C14H14Cl1N1O1)]
dipole: -0.9078002 0.0848019 -0.4976244 debye
polarizability: 233.6806027|-8.9968084|163.0678191|2.7275621|-36.8485175|120.1935788 unknown
InChI: InChI=1S/C14H14ClNO/c15-13-8-4-7-12(14(13)17-10-9-16)11-5-2-1-3-6-11/h1-8H,9-10,16H2
charge 0 multiplicity 1
31 atoms
Cl 3.5447 -1.511896 0.861671
O  0.547996 -1.173691 0.857829
N  -1.150842 -4.337431 -0.165349
C  0.488152 1.029918 -0.25556
C  1.214428 -0.086918 0.266262
C  -1.004496 1.094467 -0.221583
C  1.227589 2.110817 -0.809072
C  2.629603 -0.078227 0.210899
C  0.107776 -2.232446 -0.09685
C  -1.714947 1.638879 -1.327624
C  -1.74699 0.666395 0.914271
C  2.636651 2.099515 -0.850085
C  3.354259 0.997878 -0.333111
C  -0.623979 -3.297462 0.731458
C  -3.121471 1.755565 -1.301379
C  -3.153038 0.787743 0.940726
C  -3.84825 1.331483 -0.164949
H  0.683042 2.985248 -1.180722
H  -0.567259 -1.782351 -0.852731
H  0.989066 -2.668209 -0.602986
H  -1.162842 1.950634 -2.222019
H  -1.214974 0.245434 1.77139
H  3.181632 2.950683 -1.27077
H  4.447502 0.972335 -0.34883
H  0.097824 -3.754668 1.430922
H  -1.398934 -2.791161 1.34949
H  -3.648575 2.171172 -2.167566
H  -3.706283 0.462734 1.829209
H  -4.939967 1.422713 -0.141521
H  -2.018241 -4.10739 -0.652961
H  -1.122633 -5.293362 0.188442
