program: Gaussian 09
title: 000152302
version: EM64L-G09RevD.01
frameworkgroup: C1[X(C6H11N3O5)]
method: RPBEPBE
basis: SDD
operation: Freq
keyword: #p
keyword: freq=noraman
keyword: PBEPBE/SDD
title: #p freq=noraman PBEPBE/SDD
converged: YES YES NO NO
title: Mulliken charges:
elementType: O O O O O N N N C C C C C C H H H H H H H H H H H
charge: -0.420495 -0.454351 -0.467781 -0.435118 -0.193497 -0.137362 0.015643 -0.036614 -0.147915 -0.145907 -0.176149 -0.176119 -0.325802 -0.054406 0.299462 0.273837 0.268025 0.246708 0.221236 0.195941 0.353616 0.202340 0.359798 0.378045 0.356866
chargesum: 0.00000
title: Mulliken charges with hydrogens summed into heavy atoms:
elementType: O O O O O N N N C C C C C C
charge: -0.066879 -0.094553 -0.089736 -0.078252 -0.193497 -0.137362 0.015643 -0.036614 0.151548 0.127930 0.091876 0.070589 0.091375 0.147933
polarizability: 1.12031661e+02 3.14635873e+00 1.28877813e+02 3.87221124e-03 2.07017219e-01 7.81438028e+01
1716.lowfreq: -8.1448 -0.0003 0.0005 0.0008 7.2236 10.0597 39.8849 51.2975 61.0273
frequency: 39.4684 51.1486 61.0094 76.2121 92.3371 108.9435 130.1546 164.4027 187.2839 220.0047 256.1511 257.3469 285.1864 300.5826 318.9950 356.7274 461.2867 471.4284 486.3810 492.2254 507.0853 568.6190 575.9822 586.6431 661.6461 685.5088 709.7282 805.0083 810.9360 864.8362 903.2568 953.4437 983.8319 1000.5631 1014.4106 1028.6164 1065.0854 1078.8007 1121.4881 1158.7984 1185.1241 1219.4057 1231.0298 1238.2344 1256.0035 1265.7169 1283.8755 1311.2535 1326.7919 1338.3087 1345.1204 1363.0794 1370.6316 1376.3414 1397.5001 1471.9039 1622.0963 2056.6151 2946.7921 2957.9737 2962.5706 2995.4826 3045.2432 3060.9366 3063.1325 3412.7286 3465.0206 3481.6037 3497.3097
redmass: 5.1503 7.5679 9.6188 7.6940 5.0906 4.3759 6.3925 4.4774 4.7912 5.1526 4.9117 5.3347 6.3792 5.2240 7.0181 5.3418 1.4556 1.3070 2.5611 6.7587 2.0909 1.6484 1.3483 1.8019 4.0020 3.1910 4.3391 3.4214 3.8904 2.9412 2.6357 2.6188 3.9688 3.1899 2.2845 3.5365 3.1624 3.3163 2.4720 1.1125 1.2683 1.3069 1.2795 1.6616 4.2227 1.5004 1.3557 1.2463 1.2405 1.2818 1.3030 1.3829 1.2093 1.1981 1.2502 1.0914 8.7164 13.6226 1.0817 1.0658 1.0886 1.0839 1.0911 1.0873 1.0906 1.0645 1.0647 1.0647 1.0648
irintensity: 2.0072 2.0490 1.1120 0.2478 3.9177 12.1382 4.5706 0.9749 8.8284 10.0641 8.3077 7.0482 18.6780 15.2651 8.0857 3.5474 49.0773 63.7426 8.0844 25.6441 72.0778 107.2740 189.5667 57.6570 26.7656 21.8749 41.6911 28.5988 26.0959 20.2023 44.3017 43.3444 14.6479 76.7074 60.5006 30.1553 43.0099 24.2069 8.8857 138.2044 16.3999 16.4322 9.1532 49.5956 73.8557 12.7071 15.3340 7.4885 33.7892 60.3503 8.8047 26.5109 55.5398 40.6080 4.9794 2.2610 135.2689 378.0930 11.0623 49.2894 63.4203 6.4190 16.0343 32.9225 38.4686 54.9055 31.4247 21.2791 16.1233
temp: 298.150 k
press: 1.00000 atm
elementType: 8 8 8 8 8 7 7 7 6 6 6 6 6 6 1 1 1 1 1 1 1 1 1 1 1
symmnumber: 1
zpe: 487175.5 jmol-1
zpe.correction: 0.185555 hartree
zpe.thermalcorrener: 0.200904 hartree
zpe.thermalcorrenthalpy: 0.201848 hartree
zpe.thermalcorrgfe: 0.142122 hartree
zpe.sumelectzpe: -774.390522 hartree
zpe.sumelectthermal: -774.375173 hartree
zpe.sumelectthermalent: -774.374229 hartree
zpe.sumelectthermalfe: -774.433955 hartree
dipole: -0.9847 -0.5958 -0.1314
dipole: 1.1584
quadrupole: -90.3949 -99.1751 -83.8406
quadrupole: 6.5593 -0.6738 3.6666
quadrupole: 0.7420 -8.0382 7.2962 6.5593 -0.6738 3.6666
hfenergy: -774.5760773 hartree
pointgroup: C01 [X(C6H11N3O5)]
dipole: 0.429676 0.1503635 -0.0220401 debye
dipolederiv: -0.7388028 0.039963 0.0703961 0.1043902 -0.6439976 -0.0378067 0.0751768 -0.0555562 -0.201116 -0.7402549 0.120028 0.186039 0.1043181 -0.605313 0.1589239 0.1771594 0.1524444 -0.4768363 -0.4161856 -0.0254549 -0.0739185 -0.0132583 -0.5056241 0.0009734 -0.1873058 0.0238821 -0.6848288 -0.4507562 0.2652631 -0.1333394 0.2455491 -0.785578 -0.0671957 -0.1261049 -0.0444258 -0.4798229 -0.9565631 -0.0026049 -0.000528 0.2358404 -0.2831926 0.049873 -0.0944727 0.0690013 -0.4450811 -0.3268535 -0.0171796 0.0862783 -0.4272396 -1.4390618 -0.2569204 0.0664199 -0.1223112 -0.227995 0.108601 0.1806688 -0.0481693 0.5076693 1.7597319 0.214268 -0.0451138 0.1383095 0.063569 -0.1464275 -0.2033484 -0.0256222 -0.2898252 -0.8983908 -0.1132266 -0.0360212 -0.1266862 -0.0960886 0.2785027 0.2723399 0.1135105 0.2944813 0.4495699 0.1319378 0.0721411 0.1819971 0.2754245 0.5228136 -0.1005707 -0.0713697 -0.123967 0.3932549 -0.056958 0.0499117 -0.0728354 0.1415012 0.49798 0.0531582 -0.1031691 -0.0166299 0.3094327 -0.0856274 -0.1123251 -0.0489601 0.2832512 -0.3114036 -0.1350207 0.2057021 0.0331746 0.3163305 -0.0805286 0.3532843 -0.0359538 0.3204882 0.3407018 -0.1144198 0.0142084 -0.1135651 0.5157444 0.1510944 0.0533116 0.1308979 0.2156396 1.1866838 -0.0599848 -0.0330813 -0.2584661 0.1403253 -0.1264955 -0.238183 -0.1880697 0.5321137 0.0276941 -0.0771973 -0.0437163 0.0062755 -0.048942 0.0693467 -0.0444836 -0.0093014 -0.0496004 0.0553279 0.0222435 -0.0092099 0.0053636 0.0182088 0.0442671 -0.0191923 0.0740728 -0.0523473 -0.0239747 -0.0446515 -0.0348526 -0.0709282 0.0222473 -0.0333037 -0.0948706 -0.0144466 -0.0126145 0.1068567 0.04519 -0.0108295 0.0321889 -0.1217086 0.0503473 0.0243897 -0.0052367 0.0180234 -0.0099341 -0.067515 -0.0925982 -0.0314769 -0.0741524 -0.107664 -0.0479795 -0.1127568 -0.0439088 -0.1563512 0.0018136 0.1029543 -0.0471645 0.0479499 0.0120908 0.1038574 -0.0258694 0.0302813 0.3681374 0.0309011 -0.022323 0.0358377 0.3328532 -0.0080704 -0.0242987 0.0548594 0.1024252 0.0392271 0.0329508 -0.0379674 0.0156515 0.0724275 0.0996207 0.0109273 0.1026578 -0.1526119 0.318465 -0.1486603 -0.0655401 -0.0872648 0.3477546 -0.0650334 -0.0786004 -0.0331084 0.2367888 0.207557 0.0255999 -0.0838928 -0.02531 0.3017013 0.0185719 0.0433585 -0.0074884 0.421073 0.2189588 -0.093512 0.1110387 -0.1156447 0.3784287 0.0375152 0.1190139 -0.0251164 0.2822725 unknown
polarizability: 114.0281392|6.1903766|126.4033079|1.8513965|4.5727885|78.6218294 unknown
InChI: InChI=1S/C6H11N3O5/c7-9-8-5(3(12)1-10)6(14)4(13)2-11/h2-6,10,12-14H,1H2
charge 0 multiplicity 1
25 atoms
O  0.984308 -1.774233 -0.599357
O  -2.523487 1.212849 1.176721
O  2.005088 -0.263125 1.526827
O  -1.851211 3.389576 -0.43299
O  4.144257 -0.098625 -0.094518
N  -1.829938 -0.894658 -0.429342
N  -1.849868 -2.160863 -0.518569
N  -2.053088 -3.311023 -0.708615
C  -0.706287 -0.222679 0.3144
C  0.630001 -0.361041 -0.467578
C  -1.198376 1.228843 0.528653
C  1.793583 0.383085 0.238581
C  -1.30492 2.075441 -0.759144
C  3.075525 0.326441 -0.594679
H  -0.574778 -0.694111 1.309867
H  0.501529 0.004111 -1.501303
H  -0.546866 1.740038 1.25754
H  1.536774 1.45715 0.372935
H  -1.935492 1.543381 -1.5034
H  -0.314304 2.272925 -1.206461
H  1.340566 -2.063105 0.285682
H  3.014453 0.695323 -1.643386
H  -3.060167 0.516369 0.705444
H  2.991368 -0.391683 1.635461
H  -2.608872 3.229413 0.192431
