program: Gaussian 09
title: 000152291
version: EM64L-G09RevD.01
frameworkgroup: C1[X(C17H11Cl)]
method: RPBEPBE
basis: SDD
operation: Freq
keyword: #p
keyword: freq=noraman
keyword: PBEPBE/SDD
title: #p freq=noraman PBEPBE/SDD
converged: YES YES NO NO
title: Mulliken charges:
elementType: Cl C C C C C C C C C C C C C C C C C H H H H H H H H H H H
charge: -0.085353 -0.475212 0.144410 0.285878 0.224112 0.240183 0.560042 0.467535 -0.424535 -0.447279 -0.407986 -0.392944 -0.441460 -0.438805 -0.214603 -0.814041 -0.264155 -0.234033 0.251036 0.241416 0.226742 0.267161 0.253662 0.242737 0.223911 0.274769 0.278197 0.229941 0.228674
chargesum: 0.00000
title: Mulliken charges with hydrogens summed into heavy atoms:
elementType: Cl C C C C C C C C C C C C C C C C C
charge: -0.085353 -0.475212 0.144410 0.285878 0.224112 0.240183 0.560042 0.467535 -0.173500 -0.205863 -0.181244 -0.125783 -0.187799 -0.196068 0.009309 -0.261075 -0.034214 -0.005359
polarizability: 2.63199642e+02 1.47249346e+01 2.66966707e+02 -9.80028101e+00 5.58231579e+00 8.66380405e+01
1716.lowfreq: -9.3786 -3.8117 -3.3603 -0.0006 0.0012 0.0019 51.5920 56.8699 104.6745
frequency: 51.5838 56.8663 104.6719 120.6559 157.8558 195.1917 220.9616 276.5257 293.2139 323.1127 379.7267 431.4644 435.9846 459.0814 476.4394 496.8779 529.5882 557.6399 566.1636 607.8673 615.2275 628.9583 662.9989 695.8574 722.2468 754.0074 754.8572 766.1114 790.3271 820.1690 856.3353 877.4031 882.4259 887.0091 923.9789 941.8542 949.0455 967.6210 984.4771 985.8071 988.9141 1026.0560 1038.8042 1088.1466 1102.9056 1125.5091 1159.6055 1174.4317 1191.9037 1210.3403 1233.6732 1243.1235 1253.0793 1276.0576 1295.9961 1333.4751 1386.5256 1396.4280 1417.6463 1438.6654 1440.3317 1466.7063 1473.4046 1477.7530 1492.8710 1581.6979 1605.3039 1615.7607 1619.5785 1625.4569 3067.0422 3121.8095 3126.0041 3126.9886 3138.0006 3139.6890 3145.6961 3148.0075 3154.1100 3158.3511 3168.2189
redmass: 9.7461 7.6717 5.1040 3.8956 6.8969 4.0957 3.9466 3.1022 4.5192 5.0155 5.0353 3.5536 3.4665 6.0856 5.1902 4.4478 4.5524 5.8694 3.7511 5.4122 6.3841 3.4911 6.1752 4.1594 4.9392 4.2058 1.5285 1.5078 2.4812 2.5544 1.9802 2.0456 2.7138 2.1501 1.4567 3.7208 1.4453 1.3834 1.4908 1.4243 3.2277 2.1912 2.0748 1.7993 2.1862 1.3775 1.2152 1.0910 1.3617 2.2446 1.9986 1.2750 1.8390 2.2569 1.6601 3.4970 3.9795 3.2224 2.3125 3.0138 2.8577 1.1403 4.7347 5.8437 3.5516 6.2502 8.3581 7.5622 7.0895 7.7053 1.0575 1.0870 1.0859 1.0859 1.0914 1.0913 1.1087 1.0984 1.0948 1.0984 1.0993
irintensity: 1.4285 0.9684 3.7636 0.0783 3.1630 0.9212 1.8327 2.7829 0.8111 0.9833 7.9132 0.4974 0.8343 0.2610 0.7436 12.2190 11.4744 0.6125 10.1458 22.4998 5.3135 19.6033 2.1794 23.3123 7.5129 8.1405 17.3915 94.5094 3.6263 16.4292 50.8117 2.2959 0.9679 5.0146 0.0584 4.1098 2.2955 0.2027 0.0389 2.2091 0.6869 3.7711 6.7395 1.4931 1.3498 11.9874 2.8182 1.5097 2.1513 2.3608 2.9321 6.8641 28.3980 1.5091 0.2448 4.1177 4.5233 7.7593 6.0304 22.7932 6.0303 13.8200 11.0442 43.6985 4.3578 0.1901 2.2976 2.7921 2.8976 1.8401 21.8830 5.4971 1.6243 0.1559 12.2492 7.1196 0.9931 35.6019 21.7507 42.1568 25.7478
temp: 298.150 k
press: 1.00000 atm
elementType: 17 6 6 6 6 6 6 6 6 6 6 6 6 6 6 6 6 6 1 1 1 1 1 1 1 1 1 1 1
symmnumber: 1
zpe: 583073.4 jmol-1
zpe.correction: 0.222081 hartree
zpe.thermalcorrener: 0.235283 hartree
zpe.thermalcorrenthalpy: 0.236227 hartree
zpe.thermalcorrgfe: 0.181732 hartree
zpe.sumelectzpe: -1113.302260 hartree
zpe.sumelectthermal: -1113.289058 hartree
zpe.sumelectthermalent: -1113.288114 hartree
zpe.sumelectthermalfe: -1113.342609 hartree
dipole: -2.1408 -0.1963 -1.5741
dipole: 2.6644
quadrupole: -102.8578 -93.5138 -116.6750
quadrupole: 2.0969 -8.1950 3.5906
quadrupole: 1.4911 10.8351 -12.3262 2.0969 -8.1950 3.5906
hfenergy: -1113.524341 hartree
pointgroup: C01 [X(C17H11Cl1)]
dipole: 0.5335951 -0.6155321 -0.6597435 debye
polarizability: 279.5270124|-3.3444599|251.2786706|-3.1478279|-3.5496526|85.9987061 unknown
InChI: InChI=1S/C17H11Cl/c18-10-12-9-8-11-4-3-7-15-13-5-1-2-6-14(13)17(12)16(11)15/h1-9H,10H2
charge 0 multiplicity 1
29 atoms
Cl -1.187789 3.881654 1.097698
C  0.977718 -0.314393 -0.036237
C  0.017131 0.741987 -0.163355
C  0.338022 -1.592423 0.056899
C  -1.320038 0.094414 -0.116393
C  -1.11991 -1.332511 0.002043
C  2.38271 -0.130414 -0.018359
C  0.494024 2.059212 -0.307212
C  1.138585 -2.732475 0.176808
C  2.847787 1.224912 -0.133103
C  1.922953 2.267306 -0.27341
C  -2.627199 0.620876 -0.141262
C  -2.218806 -2.207416 0.064256
C  3.185894 -1.31616 0.109739
C  2.567807 -2.573479 0.203655
C  -0.401061 3.236128 -0.538628
C  -3.729409 -0.269405 -0.080328
C  -3.529386 -1.667307 0.015665
H  0.708276 -3.737136 0.251384
H  3.922251 1.440507 -0.118422
H  2.288421 3.297154 -0.368107
H  -2.805267 1.699445 -0.172692
H  -2.073092 -3.28947 0.154149
H  4.278924 -1.236991 0.13307
H  3.191453 -3.46939 0.300307
H  -1.270308 3.006887 -1.170372
H  0.139022 4.111196 -0.925747
H  -4.748676 0.131565 -0.096621
H  -4.395439 -2.336572 0.064174
