program: Gaussian 09
title: 000013627
version: EM64L-G09RevD.01
frameworkgroup: C1[X(C10H14)]
method: RPBEPBE
basis: SDD
operation: Freq
keyword: #p
keyword: freq=noraman
keyword: PBEPBE/SDD
title: #p freq=noraman PBEPBE/SDD
converged: YES YES NO NO
title: Mulliken charges:
elementType: C C C C C C C C C C H H H H H H H H H H H H H H
charge: 0.522247 -0.537891 0.468367 0.468390 -0.586693 -0.586379 -0.570954 -0.675281 -0.817452 -0.817453 0.206473 0.206477 0.235346 0.235337 0.233502 0.222368 0.213956 0.222371 0.222612 0.233089 0.222932 0.233090 0.222916 0.222629
chargesum: 0.00000
title: Mulliken charges with hydrogens summed into heavy atoms:
elementType: C C C C C C C C C C
charge: 0.522247 -0.124941 0.468367 0.468390 -0.351346 -0.351042 -0.337452 -0.016587 -0.138819 -0.138818
polarizability: 1.30100534e+02 3.11838476e-03 1.22585904e+02 5.58656106e+00 8.12931920e-04 6.67443997e+01
1716.lowfreq: -39.2467 -18.3530 -8.8271 0.0005 0.0006 0.0006 10.9187 11.0042 45.8520
frequency: -37.1985 -17.7258 44.3863 118.1106 196.3045 203.7317 216.5384 255.3000 287.2430 308.7023 446.3356 500.7512 505.0149 523.5503 553.9532 603.1465 714.2114 788.9844 863.2600 890.9936 897.6990 904.4337 937.9353 971.7351 989.8120 1015.6280 1029.0380 1044.6104 1049.6201 1065.3340 1067.7743 1175.7985 1176.5526 1244.2360 1296.6819 1298.9074 1329.4533 1377.0608 1390.6997 1394.6100 1395.5895 1432.0751 1448.0024 1471.4434 1471.8424 1472.1537 1474.5082 1479.3914 1486.1877 1490.4751 1612.9377 1614.4785 2971.8443 2972.3866 2977.5378 2984.3304 3034.7975 3052.9438 3053.1389 3075.0138 3080.1796 3080.3793 3082.3658 3104.1327 3105.8496 3111.6075
redmass: 1.0213 1.0153 2.3344 3.1925 3.0355 1.2187 3.0508 2.5406 1.7202 3.2443 2.3136 4.5277 4.5352 3.2342 4.1320 3.2835 2.0290 1.1692 1.4273 2.8286 1.3122 1.3957 3.0307 1.6690 6.1236 1.5068 2.1266 1.5372 1.5971 1.9310 1.4659 1.4143 1.4087 1.2523 1.2210 1.7560 3.1989 6.7568 1.2042 1.2243 1.2519 2.0922 2.2116 1.0508 1.0440 1.0557 1.0604 1.2448 1.2854 1.1056 5.9394 6.0495 1.0381 1.0381 1.0354 1.0595 1.1017 1.0955 1.0955 1.0999 1.0997 1.0997 1.1011 1.0910 1.0911 1.0922
irintensity: 0.1905 0.6678 0.0521 2.5767 3.5360 0.1195 0.0335 0.7054 0.2288 1.2271 0.0380 0.3521 0.4289 0.1549 0.0861 0.2965 17.5941 2.4333 28.9652 6.0638 0.1411 2.6805 2.9771 3.5511 0.3625 1.6704 2.3181 5.3171 26.8668 12.6747 0.1543 0.1879 1.7787 0.0524 0.1631 0.8283 1.0596 0.1965 9.4522 16.8270 5.6462 1.0950 1.2107 0.5921 11.4177 25.4395 0.8833 16.2421 21.4489 16.5407 28.7555 32.9767 55.7279 23.8685 40.7588 36.1977 9.2103 2.4793 45.5554 59.5526 6.0278 26.0677 39.8916 33.0290 32.4832 2.1306
temp: 298.150 k
press: 1.00000 atm
elementType: 6 6 6 6 6 6 6 6 6 6 1 1 1 1 1 1 1 1 1 1 1 1 1 1
symmnumber: 1
zpe: 545579.3 jmol-1
zpe.correction: 0.207800 hartree
zpe.thermalcorrener: 0.217322 hartree
zpe.thermalcorrenthalpy: 0.218266 hartree
zpe.thermalcorrgfe: 0.172830 hartree
zpe.sumelectzpe: -388.719189 hartree
zpe.sumelectthermal: -388.709667 hartree
zpe.sumelectthermalent: -388.708723 hartree
zpe.sumelectthermalfe: -388.754159 hartree
dipole: 0.0392 -0.0003 -0.0310
dipole: 0.0500
quadrupole: -56.5249 -56.1827 -64.9484
quadrupole: 0.0007 1.2560 0.0000
quadrupole: 2.6938 3.0360 -5.7298 0.0007 1.2560 0.0000
hfenergy: -388.926989 hartree
pointgroup: C01 [X(C10H14)]
dipole: -0.0154243 0.0001296 -0.0122222 debye
dipolederiv: 0.3561291 -0.0000052 -0.0083011 0.0000787 0.0632575 0.0000197 -0.026363 0.0000179 -0.0634608 0.0047256 0.0000283 -0.0318723 0.0001123 0.1456229 0.0000131 -0.1558583 0.0000376 0.1074139 0.1563829 -0.158871 -0.0181487 -0.1544316 0.3184339 0.00384 0.0049705 -0.0499115 -0.0054873 0.1566643 0.1590108 -0.0181796 0.1544472 0.3182823 -0.003819 0.0049438 0.0499557 -0.0054909 -0.2446228 -0.1399463 -0.0222015 -0.1276438 -0.0782216 0.0243523 -0.0020176 0.0164239 -0.1982171 -0.2445073 0.1400805 -0.0222309 0.127608 -0.0782542 -0.0243791 -0.0020623 -0.0164765 -0.198277 -0.0035322 -0.0000246 -0.0371086 -0.000008 -0.3287602 0.0000155 -0.0349125 -0.0000238 -0.2106243 -0.0124889 0.0000247 -0.0428906 -0.0000089 0.0729612 0.0000338 0.0496653 0.000027 -0.0017837 0.0105885 0.1055738 0.0016283 0.0932581 -0.0847499 -0.0055839 -0.0415569 0.0750501 0.0748576 0.0100943 -0.1062406 0.0017112 -0.0931169 -0.0842668 0.0055491 -0.0415292 -0.0749358 0.0748556 0.0018354 -0.0177067 0.0148825 -0.0800545 -0.074842 0.1387094 0.0351846 0.0866188 -0.0191329 0.0018028 0.0177131 0.0149159 0.0800033 -0.0746719 -0.1387461 0.0352502 -0.0866591 -0.019289 0.0365385 0.0969418 0.027999 0.096906 -0.0757532 -0.0127222 0.025729 -0.0095348 0.133996 0.0365414 -0.0969719 0.0279897 -0.0968971 -0.07573 0.012721 0.0257226 0.0095368 0.1339882 -0.1303017 0.0000084 0.0473008 0.0000401 0.0837674 -0.0000152 0.0608635 0.0000002 0.1368964 0.0923456 0.070958 0.0323543 0.0284793 -0.0711047 -0.1253403 0.0087145 -0.0809209 -0.0056903 -0.2776721 0.0000126 0.0051506 0.0000078 0.104523 0.0000153 0.0016369 0.0000172 0.061296 0.0923424 -0.0709952 0.0323119 -0.0285138 -0.071251 0.125286 0.0087215 0.0808664 -0.0055299 -0.0723893 0.0343373 0.1189795 -0.0389916 0.0596161 0.037597 0.1307936 -0.0314163 0.0185673 0.0513333 0.0782233 -0.0572378 0.0717345 0.0008476 0.0421097 -0.0882856 0.0917665 -0.08672 -0.0004469 -0.1315858 -0.0643796 -0.0424834 -0.06502 -0.0631491 -0.021056 -0.0848079 0.0729931 0.0508176 -0.0783643 -0.058055 -0.0717018 0.0010915 -0.0415841 -0.0889504 -0.0913025 -0.0864617 -0.0006718 0.1322354 -0.0638697 0.0427628 -0.0652247 0.0626559 -0.0207571 0.084036 0.0735825 -0.0715089 -0.0344365 0.1192515 0.0384132 0.0594469 -0.0375786 0.1311528 0.0316349 0.0177184 unknown
polarizability: 130.1129363|0.0023238|122.5859033|-5.5157735|0.0005142|66.7319975 unknown
InChI: InChI=1S/C10H14/c1-4-10-6-8(2)5-9(3)7-10/h5-7H,4H2,1-3H3
charge 0 multiplicity 1
24 atoms
C  1.036404 0.000133 -0.338175
C  2.544415 0.000172 -0.552604
C  -1.070847 1.236445 0.036236
C  -1.070729 -1.236412 0.036147
C  0.324222 -1.218422 -0.211826
C  0.324137 1.218594 -0.211755
C  -1.751814 -0.000001 0.163182
C  3.332834 -0.000352 0.784477
C  -1.825586 2.552026 0.140705
C  -1.825427 -2.552027 0.140512
H  2.83941 0.889134 -1.143106
H  2.839366 -0.888365 -1.143771
H  0.865864 -2.169444 -0.306567
H  0.8657 2.169671 -0.30643
H  -2.831811 -0.000046 0.362697
H  3.083917 0.891269 1.388283
H  4.423506 -0.000315 0.601623
H  3.083877 -0.892411 1.387623
H  -2.707851 2.460732 0.798954
H  -2.189018 2.88298 -0.851946
H  -1.183194 3.357326 0.53939
H  -2.192524 -2.880751 -0.851532
H  -1.181821 -3.358315 0.535189
H  -2.70533 -2.461921 0.802094
