program: Gaussian 09
title: 000013626
version: EM64L-G09RevD.01
frameworkgroup: C1[X(C7H7ClOS)]
method: RPBEPBE
basis: SDD
operation: Freq
keyword: #p
keyword: freq=noraman
keyword: PBEPBE/SDD
title: #p freq=noraman PBEPBE/SDD
converged: NO YES NO NO
title: Mulliken charges:
elementType: Cl S O C C C C C C C H H H H H H H
charge: -0.045590 0.659345 -0.617843 -0.171913 -0.212644 -0.228193 -0.197469 -0.193302 -0.096461 -0.798756 0.315329 0.248972 0.265338 0.262610 0.289901 0.273278 0.247399
chargesum: 0.00000
title: Mulliken charges with hydrogens summed into heavy atoms:
elementType: Cl S O C C C C C C C
charge: -0.045590 0.659345 -0.617843 -0.171913 0.102685 0.020780 0.067869 0.069307 -0.096461 0.011822
polarizability: 1.60714638e+02 2.80187892e-01 1.02487142e+02 1.80844075e+00 2.35710101e+00 5.77770859e+01
1716.lowfreq: -4.1415 0.0023 0.0034 0.0034 6.8608 10.1065 63.5574 74.2944 132.5738
frequency: 63.5048 74.2797 132.5719 161.1461 171.1303 235.6061 267.7275 292.9546 322.5980 390.4420 410.8966 467.0644 496.4523 546.7845 615.1596 695.8669 705.9637 792.1389 818.4678 849.4067 946.6726 952.4053 959.5114 984.5798 990.0969 1043.7255 1063.8426 1099.2687 1169.8679 1277.9136 1302.6888 1373.6171 1379.3339 1413.7272 1430.3597 1449.9015 1570.0102 1593.6104 3017.4355 3114.2195 3133.9859 3159.8780 3168.9190 3170.7268 3174.8618
redmass: 4.0138 6.0393 3.2673 1.4184 3.2901 9.8465 5.5073 7.5383 5.4653 7.2733 2.9352 8.6156 3.2845 6.7383 7.1332 7.1067 3.9450 12.8307 1.3561 1.3073 1.3148 1.2785 1.3198 6.6725 1.3150 2.4285 3.4574 1.3235 1.1336 1.2337 1.1391 3.0463 9.8745 1.0540 1.0595 2.1495 6.1515 8.1549 1.0255 1.0907 1.0902 1.1059 1.1071 1.0944 1.0957
irintensity: 3.1743 1.1899 7.8748 0.9670 0.8775 1.6027 1.9240 13.1226 1.4447 13.2926 0.3736 0.9686 28.7151 22.3274 0.3425 25.8377 1.2566 35.2540 43.7962 33.6650 4.1993 32.2419 8.1102 45.5711 2.6731 7.1228 41.2990 12.5456 3.8877 2.8087 5.4051 8.8705 2.7942 12.3478 17.8862 68.2033 12.1598 1.7935 7.1925 13.4968 3.5231 6.1401 4.6767 2.7781 3.2754
temp: 298.150 k
press: 1.00000 atm
elementType: 17 16 8 6 6 6 6 6 6 6 1 1 1 1 1 1 1
symmnumber: 1
zpe: 313728.6 jmol-1
zpe.correction: 0.119493 hartree
zpe.thermalcorrener: 0.129875 hartree
zpe.thermalcorrenthalpy: 0.130819 hartree
zpe.thermalcorrgfe: 0.082758 hartree
zpe.sumelectzpe: -1203.467369 hartree
zpe.sumelectthermal: -1203.456987 hartree
zpe.sumelectthermalent: -1203.456042 hartree
zpe.sumelectthermalfe: -1203.504103 hartree
dipole: -0.2742 -3.9120 0.9418
dipole: 4.0331
quadrupole: -82.5077 -69.4705 -74.0091
quadrupole: -11.9211 3.9520 2.1836
quadrupole: -7.1786 5.8586 1.3200 -11.9211 3.9520 2.1836
hfenergy: -1203.5868619 hartree
pointgroup: C01 [X(C7H7Cl1O1S1)]
dipole: 0.1321861 -1.5157918 -0.4502391 debye
dipolederiv: -0.8842725 -0.0498224 0.0470301 -0.0517767 -0.1187734 0.0129361 0.0759003 0.0135927 -0.0707756 0.7981569 -0.0981881 -0.1195589 -0.2608835 0.5096837 0.3334264 -0.0857333 0.1598314 0.5487896 -0.616269 0.0057288 0.0904442 0.2214828 -0.4983497 -0.2845896 -0.0319772 0.0932052 -0.4372804 0.1181667 0.0713595 0.0135639 0.1436633 -0.1294936 0.0004645 0.1219771 -0.0423816 -0.1662245 -0.2149204 -0.0772792 -0.0001938 0.1298402 -0.0457152 -0.0103147 -0.0415575 0.0052229 -0.1048388 -0.14726 0.079005 -0.0433182 -0.1897292 0.0713511 -0.0474011 0.0452569 -0.044129 -0.0973708 -0.2999929 0.0946691 -0.0129552 0.0095928 0.0527634 -0.0214272 0.0008138 -0.0317907 -0.0918669 -0.314309 -0.1040692 0.0230912 -0.0415485 -0.0342376 -0.0046027 0.0093038 -0.0007045 -0.0996726 1.3085507 0.067333 -0.1004545 0.0887973 0.1268938 -0.0416576 -0.122465 -0.0379497 -0.0465036 -0.1282901 0.0221191 0.047168 -0.0010386 -0.104982 -0.0437133 0.0177466 -0.1262573 -0.165963 0.1729779 0.0640762 0.0166119 -0.0003067 0.0982276 0.0202293 0.0079325 0.0081115 0.1600758 0.0570696 -0.0890264 0.0299629 -0.0527754 -0.0176138 0.0390054 0.024748 0.0306477 0.1435922 0.0329252 -0.0526832 0.0162409 -0.0546022 0.0061364 0.0313549 0.0223193 0.0304774 0.1600747 0.0118073 0.0730373 -0.0079868 0.0586223 0.0194595 0.0246004 0.0006834 0.0212332 0.164272 0.0982968 -0.0566132 0.0448361 -0.038523 0.0221898 0.0439823 0.0424243 0.0026075 -0.0124502 -0.0869104 -0.0289362 -0.0279374 -0.0217153 0.1120306 -0.0215071 -0.0643911 -0.0355762 0.0768049 0.0942734 0.0792898 -0.0165443 0.0609005 -0.0695704 -0.0307861 -0.022982 -0.0461404 0.0393372 unknown
polarizability: 160.7169729|0.5865911|102.614569|1.6145229|0.004387|57.6473248 unknown
InChI: InChI=1S/C7H7ClOS/c1-10(9)7-4-2-6(8)3-5-7/h2-5H,1H3
charge 0 multiplicity 1
17 atoms
Cl 3.946249 0.20992 -0.211703
S  -2.511938 -0.149909 0.434831
O  -2.93788 1.457539 0.248251
C  -0.610123 -0.126566 0.216831
C  -0.051137 1.133114 -0.049157
C  0.16987 -1.285932 0.379743
C  1.351788 1.241047 -0.185578
C  1.574639 -1.183592 0.242851
C  2.136096 0.078826 -0.040102
C  -2.904722 -0.923962 -1.293181
H  -0.722007 1.998482 -0.136553
H  -0.283432 -2.255824 0.614258
H  1.822741 2.205765 -0.394462
H  2.214725 -2.062392 0.359538
H  -2.461197 -0.247897 -2.037607
H  -4.001585 -0.940942 -1.36769
H  -2.475887 -1.936077 -1.343269
