program: Gaussian 09
title: 000152266
version: EM64L-G09RevD.01
frameworkgroup: C1[X(C21H30O3)]
method: RPBEPBE
basis: SDD
operation: Freq
keyword: #pfreq=noraman
keyword: PBEPBE/SDD
title: #p freq=noraman PBEPBE/SDD
converged: YES YES NO NO
title: Mulliken charges:
elementType: O O O C C C C C C C C C C C C C C C C C C C C C H H H H H H H H H H H H H H H H H H H H H H H H H H H H H H
charge: -0.447504 -0.208255 -0.236703 0.344300 -0.098916 -0.152461 -0.109357 -0.236629 0.235651 -0.257969 -0.552994 -0.554721 -0.477306 -0.481277 -0.835533 0.540287 -0.642930 -0.495203 -0.813707 0.165242 -0.563197 -0.585949 0.177751 -0.809682 0.246394 0.225439 0.241111 0.203100 0.232813 0.245548 0.225725 0.212881 0.233664 0.264226 0.213286 0.226524 0.220051 0.258402 0.220735 0.230720 0.221555 0.235412 0.228058 0.211641 0.220927 0.226709 0.235892 0.337926 0.245534 0.230219 0.255049 0.241894 0.241134 0.264497
chargesum: 0.00000
title: Mulliken charges with hydrogens summed into heavy atoms:
elementType: O O O C C C C C C C C C C C C C C C C C C C C C
charge: -0.109578 -0.208255 -0.236703 0.344300 0.147478 0.072978 0.131754 -0.033529 0.235651 -0.025156 -0.081721 -0.108176 0.000206 -0.034702 -0.125676 0.540287 -0.185963 -0.055504 -0.130181 0.165242 -0.087444 -0.330900 0.177751 -0.062158
polarizability: 2.99653745e+02 -6.12101557e+00 2.07980668e+02 -1.36664917e+01 2.41533676e-01 1.76559008e+02
1716.lowfreq: -6.9173 -0.0006 -0.0003 0.0004 8.3649 14.6472 32.2184 46.1791 59.9429
frequency: 32.0500 46.1429 59.8788 70.6553 95.1892 102.6346 122.4055 140.5860 158.5698 164.7477 180.5085 189.8049 206.9156 209.5746 224.1517 244.7711 247.1949 255.9706 266.4507 272.0694 278.1381 312.1722 318.4813 344.4694 361.1300 372.9574 385.3894 417.1694 439.3325 443.1084 451.8473 467.5538 498.2413 526.0944 533.0566 546.5060 560.0225 580.8280 592.1020 625.3475 646.9245 672.2127 679.8680 723.0405 756.6943 777.2878 807.6499 818.7530 837.1426 844.4515 859.8282 884.1201 898.1219 913.4061 915.3430 922.1098 929.3979 946.1702 960.2023 965.1048 975.7776 985.9704 1002.2794 1007.3281 1025.4576 1027.7800 1041.7733 1046.0775 1057.2662 1067.1309 1080.9211 1095.8583 1112.4863 1116.2528 1124.5435 1126.7714 1148.5075 1156.0539 1171.2378 1180.4131 1184.2526 1192.1814 1195.2462 1204.6378 1216.3625 1227.4049 1233.4617 1242.6482 1250.4940 1260.1534 1278.4797 1280.3870 1287.8651 1295.2677 1297.3700 1319.4814 1322.1419 1325.9408 1329.9139 1337.6860 1340.9175 1345.1538 1350.2696 1353.5906 1360.7022 1362.2431 1365.9591 1379.8674 1387.5402 1405.4201 1442.7872 1444.3801 1455.6083 1456.9468 1458.3753 1465.9149 1467.9274 1471.1729 1479.2422 1480.3453 1488.7565 1494.4258 1495.3267 1584.6333 1622.7206 1623.5254 2931.9258 2936.6744 2950.3335 2951.3935 2963.7180 2970.0750 2972.8584 2975.4218 2977.0282 2979.8529 2985.2843 2988.8759 2993.0626 3008.0102 3015.3061 3036.6381 3040.4281 3041.8993 3051.1721 3053.5687 3062.0671 3064.0937 3073.5630 3077.0754 3079.7823 3081.2983 3099.8222 3116.3083 3117.0452 3566.6483
redmass: 6.7753 3.9593 4.0878 4.5558 4.1316 2.5499 1.2787 2.8824 3.5107 3.0796 2.0373 2.9676 2.5068 2.6705 1.6128 1.7747 1.4835 1.7513 1.9338 2.7738 2.1245 3.3075 3.2758 3.2015 2.6642 2.9269 2.7592 3.1606 3.1493 3.7042 3.3336 2.7992 3.6853 2.8824 2.9221 3.1269 2.9434 3.7791 2.8652 3.7140 3.8404 2.9322 2.9518 2.5467 2.7892 2.3840 2.2233 2.2853 2.1388 2.0562 2.3790 1.4671 2.1269 2.1110 2.7884 1.8505 1.8715 1.8675 2.0187 2.2509 2.0571 2.0714 1.9750 2.4267 2.0873 1.9017 2.0624 2.0322 2.4990 2.4798 2.6022 1.9159 1.9740 2.3274 2.1035 1.7844 2.0682 1.6630 1.5725 1.9473 1.6501 1.7770 2.1247 1.5508 1.2542 1.7345 1.5484 1.4218 1.4468 1.4531 1.5459 1.6689 1.3775 1.4263 1.4601 1.3782 1.4778 1.4426 1.4638 1.4928 1.6356 1.8198 1.4498 1.4391 1.3016 1.3327 1.3464 1.3508 1.2356 1.1933 1.0743 1.0796 1.0871 1.0553 1.0788 1.0818 1.0900 1.0704 1.0554 1.0697 1.0579 1.0813 1.0587 10.0288 7.4391 7.6803 1.0838 1.0796 1.0807 1.0671 1.0776 1.0552 1.0636 1.0664 1.0660 1.0613 1.0366 1.0410 1.0598 1.0608 1.0629 1.0950 1.0995 1.0995 1.1005 1.0961 1.0956 1.1005 1.0953 1.0989 1.1034 1.0987 1.0988 1.0990 1.0912 1.0662
irintensity: 3.3971 2.0331 2.2120 2.9164 1.0752 5.2522 0.3984 1.1440 2.5018 0.2831 0.2111 10.4617 4.5249 12.1572 0.2400 13.1911 63.9066 17.5298 3.7807 2.9451 16.2073 1.5983 1.4655 1.8950 2.8060 2.1819 1.6719 3.1261 0.5862 2.1536 3.3758 6.2597 3.3853 2.7100 4.1912 0.7150 4.8757 8.9213 2.2428 3.2356 0.9146 5.7174 8.5397 1.4659 3.8415 7.3328 0.2909 0.0212 1.3685 5.8163 11.2233 9.0513 4.0366 12.0663 6.0638 2.1686 5.4883 22.7622 9.0500 8.3241 23.9602 2.3958 2.6376 18.9819 10.5694 3.6839 2.2665 4.2589 2.9535 8.5903 9.1057 2.2619 14.7438 3.9062 5.7438 4.2979 13.0423 9.2537 3.9148 33.7691 20.3967 38.2634 11.0290 57.1092 5.9545 5.5900 23.7012 22.3301 13.6125 13.6921 33.5227 10.2273 2.9547 6.4290 23.3761 2.9971 3.5678 8.6437 16.4947 9.5989 12.7798 1.6621 2.6908 5.8676 24.8246 43.2853 9.8780 8.1673 14.9580 31.2247 16.3101 18.0357 18.8525 11.0362 18.9275 3.3430 4.8106 10.9498 4.4070 2.5157 7.1788 11.4145 7.7128 164.9908 225.4486 88.5124 71.7405 0.2840 4.1844 13.3004 8.6281 0.9434 32.5366 26.4402 17.4041 37.6562 21.7276 17.9836 33.3679 33.6750 31.3524 43.4027 9.4743 61.7947 25.3777 12.4404 22.6374 20.0026 30.5709 35.0223 35.1152 26.5118 18.8349 16.4648 10.7389 2.6386
temp: 298.150 k
press: 1.00000 atm
elementType: 8 8 8 6 6 6 6 6 6 6 6 6 6 6 6 6 6 6 6 6 6 6 6 6 1 1 1 1 1 1 1 1 1 1 1 1 1 1 1 1 1 1 1 1 1 1 1 1 1 1 1 1 1 1
symmnumber: 1
zpe: 1224248.1 jmol-1
zpe.correction: 0.466291 hartree
zpe.thermalcorrener: 0.489598 hartree
zpe.thermalcorrenthalpy: 0.490542 hartree
zpe.thermalcorrgfe: 0.415669 hartree
zpe.sumelectzpe: -1042.051356 hartree
zpe.sumelectthermal: -1042.028049 hartree
zpe.sumelectthermalent: -1042.027105 hartree
zpe.sumelectthermalfe: -1042.101978 hartree
dipole: -4.1858 -0.4314 0.7926
dipole: 4.2820
quadrupole: -201.0748 -136.6872 -145.4489
quadrupole: 11.0013 23.8797 -2.0413
quadrupole: -40.0045 24.3832 15.6214 11.0013 23.8797 -2.0413
hfenergy: -1042.5176473 hartree
pointgroup: C01 [X(C21H30O3)]
dipole: 1.6484844 -0.1749611 -0.2999616 debye
polarizability: 299.7701102|5.9142191|207.9663197|-13.2113117|-0.9466834|176.4569913 unknown
InChI: InChI=1S/C21H30O3/c1-12(22)16-6-7-17-15-5-4-13-10-14(23)8-9-20(13,2)18(15)11-19(24)21(16,17)3/h10,15-19,24H,4-9,11H2,1-3H3
charge 0 multiplicity 1
54 atoms
O  1.39983 -1.733842 1.566491
O  5.590132 -0.033587 -0.766759
O  -6.241182 -0.450974 0.985234
C  2.262647 -0.120797 -0.179207
C  1.371108 1.035259 0.375334
C  -0.039247 1.085965 -0.250344
C  -0.746093 -0.282502 0.007769
C  1.555591 -1.473837 0.117438
C  -2.224839 -0.350101 -0.558511
C  3.595441 0.168023 0.632699
C  0.122115 -1.483262 -0.46031
C  2.28361 2.280609 0.285398
C  3.713811 1.728418 0.604479
C  -0.876812 2.23556 0.351624
C  2.541709 -0.015022 -1.701723
C  -2.99941 0.887578 -0.066825
C  -2.317587 2.235424 -0.212599
C  -2.905087 -1.648654 -0.020493
C  -2.248333 -0.347692 -2.121119
C  4.831779 -0.555718 0.095794
C  -4.4412 -1.657207 -0.161445
C  -4.271071 0.81122 0.443799
C  -5.07335 -0.427303 0.487249
C  5.116277 -1.952085 0.643855
H  1.224468 0.803257 1.454099
H  0.051199 1.265316 -1.343325
H  -0.837021 -0.369857 1.112843
H  2.126605 -2.309105 -0.347178
H  3.419852 -0.165779 1.675863
H  -0.343214 -2.433939 -0.146646
H  0.195099 -1.503884 -1.56325
H  1.981407 3.072749 0.992739
H  2.249063 2.719458 -0.730076
H  4.449844 2.024654 -0.162569
H  4.085585 2.100146 1.575887
H  -0.398459 3.210397 0.139113
H  -0.911236 2.122157 1.454805
H  3.201685 0.836769 -1.935149
H  3.055527 -0.92294 -2.070466
H  1.614088 0.102259 -2.286242
H  -2.265352 2.494006 -1.292288
H  -2.928022 3.020561 0.269664
H  -2.648118 -1.759538 1.052262
H  -2.488501 -2.529772 -0.542911
H  -1.719663 0.525271 -2.542813
H  -1.772114 -1.259837 -2.522819
H  -3.286738 -0.319183 -2.496557
H  2.283866 -1.946248 1.957851
H  -4.884073 -2.562802 0.289627
H  -4.736069 -1.660641 -1.230979
H  -4.777037 1.714925 0.808798
H  5.358119 -1.891863 1.723179
H  4.231082 -2.609344 0.542811
H  5.966889 -2.405668 0.111597
