program: Gaussian 09
title: 000152259
version: EM64L-G09RevD.01
frameworkgroup: C1[X(C6H14O14P2)]
method: RPBEPBE
basis: SDD
operation: Freq
keyword: #p
keyword: freq=noraman
keyword: PBEPBE/SDD
title: #p freq=noraman PBEPBE/SDD
converged: NO YES NO NO
title: Mulliken charges:
elementType: P P O O O O O O O O O O O O O O C C C C C C H H H H H H H H H H H H H H
charge: 1.348864 1.388181 -0.533089 -0.478454 -0.449894 -0.510832 -0.417770 -0.407597 -0.517788 -0.195107 -0.691946 -0.695657 -0.574394 -0.719769 -0.642850 -0.527341 -0.167469 -0.163437 -0.114624 -0.155276 -0.040756 0.245751 0.278530 0.280078 0.287381 0.286797 0.232667 0.416849 0.385075 0.401523 0.385951 0.373898 0.425642 0.408257 0.428838 0.429767
chargesum: 0.00000
title: Mulliken charges with hydrogens summed into heavy atoms:
elementType: P P O O O O O O O O O O O O O O C C C C C C
charge: 1.348864 1.388181 -0.116240 -0.093379 -0.048371 -0.510832 -0.031819 -0.033698 -0.517788 -0.195107 -0.266304 -0.287400 -0.574394 -0.290931 -0.213083 -0.527341 0.111061 0.116641 0.172757 0.131521 0.191912 0.245751
polarizability: 1.96856971e+02 -7.36719490e+00 1.59218058e+02 5.24481882e+00 -2.40683332e+00 1.31159525e+02
1716.lowfreq: -0.0015 -0.0012 -0.0011 2.1814 5.7645 9.4964 24.0364 29.4614 34.5323
frequency: 23.8289 29.4422 34.4626 56.3682 59.9305 66.0812 80.6695 83.7003 102.7661 121.2949 125.9338 129.9478 143.3678 158.8368 198.8454 213.3319 220.7538 228.3327 234.3370 244.0780 246.1613 260.9707 269.9824 278.5991 299.9609 316.9264 321.9336 325.4439 328.9719 348.6796 355.6111 359.9106 365.5047 383.9550 402.3813 409.1734 438.0003 458.1173 474.5220 509.6075 556.0587 572.4992 588.9279 623.0650 653.0672 660.3832 674.0772 694.7133 721.3388 753.4436 762.8219 765.6250 789.3851 806.7407 818.2449 856.7379 924.3743 957.2540 970.1424 985.8860 999.4721 1012.7945 1026.7899 1036.9920 1047.8398 1050.9602 1075.1109 1080.1195 1099.0651 1107.1158 1118.0914 1180.7041 1216.2430 1230.1208 1261.2559 1274.8886 1280.4856 1291.7259 1299.6986 1326.0318 1346.4934 1354.1062 1367.0289 1386.3453 1394.8799 1406.1136 1435.1598 1662.0948 2753.4102 2953.9254 2993.4805 3013.2783 3057.8166 3081.7384 3433.8093 3472.3455 3472.7569 3488.2052 3565.5142 3582.4765 3591.1116 3613.9925
redmass: 8.9920 10.1338 7.2213 9.0691 10.4668 8.8437 7.7082 4.2081 5.3991 2.9032 3.5943 6.5872 7.3347 6.7106 5.0701 3.7562 4.3440 5.4373 6.1041 5.3779 4.8422 2.6405 2.0383 3.6362 5.3109 2.9942 5.2231 2.3457 5.6481 3.2831 5.2042 3.6878 2.4438 4.1120 4.3706 4.9955 5.8610 1.8933 3.8510 1.1878 1.7320 5.1338 2.1670 7.9747 1.7108 5.6968 3.6193 8.6684 5.4817 7.8797 7.8814 7.7181 8.7646 4.7470 4.9851 4.7386 2.5023 1.4632 5.1285 4.5853 1.3629 3.4983 4.2997 4.2307 2.4799 3.4288 2.4121 1.2217 5.9266 2.7837 2.4265 1.1715 1.1539 1.2436 1.2207 1.0769 1.4321 1.2718 1.2916 1.2145 1.1013 1.3839 1.1668 1.1967 1.2799 1.3889 1.6603 10.9995 1.0725 1.0841 1.0845 1.0856 1.0837 1.0860 1.0668 1.0655 1.0642 1.0647 1.0656 1.0662 1.0663 1.0665
irintensity: 1.5780 1.0412 4.1842 4.1884 1.3178 5.0220 3.6463 33.8115 14.0870 13.1964 36.9660 3.2806 5.4153 10.3609 9.3218 43.5981 10.9028 10.6425 15.8222 9.6881 12.7590 64.0310 26.2108 42.2778 10.4372 65.4616 37.6898 41.9503 54.3085 44.1536 80.9052 71.1020 40.3221 54.6475 15.5185 31.8906 59.9337 151.0650 48.7479 143.0126 29.4644 10.4233 4.0741 87.9719 177.1357 49.5639 26.2995 166.4269 21.7668 204.3688 258.1362 99.1397 268.9349 21.9627 158.8182 40.5129 79.4491 182.2151 46.9314 130.2986 19.8920 148.7614 234.5252 55.1833 151.2263 68.6813 46.5083 122.4915 284.5217 29.8827 133.0193 58.0316 68.1297 34.8794 41.8463 62.4647 24.6322 68.5268 3.8992 21.1107 35.0039 14.2374 1.6920 60.5744 42.6937 14.5684 12.2014 186.1278 1382.9527 34.1484 6.4181 29.3374 3.1658 5.7403 212.5175 110.9199 49.1571 61.7530 21.1611 37.5200 116.1267 78.0430
temp: 298.150 k
press: 1.00000 atm
elementType: 15 15 8 8 8 8 8 8 8 8 8 8 8 8 8 8 6 6 6 6 6 6 1 1 1 1 1 1 1 1 1 1 1 1 1 1
symmnumber: 1
zpe: 629756.7 jmol-1
zpe.correction: 0.239862 hartree
zpe.thermalcorrener: 0.266250 hartree
zpe.thermalcorrenthalpy: 0.267195 hartree
zpe.thermalcorrgfe: 0.183025 hartree
zpe.sumelectzpe: -1970.811615 hartree
zpe.sumelectthermal: -1970.785226 hartree
zpe.sumelectthermalent: -1970.784282 hartree
zpe.sumelectthermalfe: -1970.868452 hartree
dipole: 2.1091 -0.2867 0.4505
dipole: 2.1757
quadrupole: -169.5292 -146.8944 -142.9182
quadrupole: -12.2680 -24.5904 -6.2627
quadrupole: -16.4153 6.2195 10.1958 -12.2680 -24.5904 -6.2627
hfenergy: -1971.0514767 hartree
pointgroup: C01 [X(C6H14O14P2)]
dipole: -0.8216448 0.1699166 0.169448 debye
polarizability: 195.9196264|-9.6807075|160.3404956|-4.7618678|0.4311175|130.9744321 unknown
InChI: InChI=1S/C6H14O14P2/c7-1(3(9)5(11)19-21(13,14)15)2(8)4(10)6(12)20-22(16,17)18/h1-5,7-11,13-14,16-17H
charge 0 multiplicity 1
36 atoms
P  4.1997 0.050802 -0.154132
P  -3.582619 1.399769 -0.068773
O  1.146838 -0.554447 -1.738736
O  -0.355954 -2.710688 -0.765427
O  0.417945 2.044682 -1.008323
O  2.941964 1.255573 -0.131499
O  -1.295903 -2.970526 1.699747
O  1.724567 2.21183 1.670186
O  -2.424296 0.345678 0.776003
O  -3.352585 -1.691975 0.086924
O  3.342017 -1.336168 -0.621428
O  4.413179 -0.201783 1.544317
O  5.49815 0.471247 -0.946475
O  -2.4143 2.556525 -0.58276
O  -3.854109 0.594331 -1.545833
O  -4.787758 1.960251 0.778553
C  0.128581 -0.306575 -0.677995
C  0.022177 -1.608681 0.13136
C  0.454411 1.025462 0.043623
C  -1.109275 -1.629277 1.212241
C  1.795665 1.079696 0.797538
C  -2.42575 -1.070715 0.63047
H  -0.828848 -0.149823 -1.211568
H  0.978155 -1.848482 0.63934
H  -0.325088 1.217164 0.801629
H  -0.823918 -1.008213 2.075948
H  1.952008 0.141572 1.375248
H  1.238653 0.309533 -2.230028
H  0.272476 -2.742735 -1.529878
H  -0.511137 2.409522 -1.025372
H  -1.29582 -3.575877 0.907624
H  2.599443 2.326743 2.122253
H  2.508016 -1.111155 -1.199049
H  5.33653 -0.432936 1.815596
H  -2.702501 3.497522 -0.46067
H  -4.210116 -0.333043 -1.433453
