program: Gaussian 09
title: 000152248
version: EM64L-G09RevD.01
frameworkgroup: C1[X(C6H9NO2)]
method: RPBEPBE
basis: SDD
operation: Freq
keyword: #pfreq=noraman
keyword: PBEPBE/SDD
title: #p freq=noraman PBEPBE/SDD
converged: YES YES NO NO
title: Mulliken charges:
elementType: O O N C C C C C C H H H H H H H H H
charge: -0.414340 -0.235871 -0.559636 -0.201810 -0.442869 0.183478 -0.239243 0.160600 -0.612504 0.252650 0.244594 0.231667 0.284305 0.279268 0.230075 0.373972 0.233462 0.232203
chargesum: 0.00000
title: Mulliken charges with hydrogens summed into heavy atoms:
elementType: O O N C C C C C C
charge: -0.040368 -0.235871 0.003937 0.050840 0.033392 0.183478 -0.009168 0.160600 -0.146840
polarizability: 9.97771176e+01 -1.54321879e+01 7.17863513e+01 -1.19532211e+01 2.97336132e+00 6.74646780e+01
1716.lowfreq: -2.8664 0.0009 0.0011 0.0014 8.9372 9.9113 35.7545 43.2066 67.2830
frequency: 35.5896 43.1955 67.2516 139.5750 219.2426 238.9448 251.4397 297.5132 322.0343 345.8593 454.6569 540.9107 566.7945 603.4000 615.7683 660.7432 713.9586 773.4728 876.0115 878.6140 933.7462 970.3567 998.4146 1015.3399 1039.0902 1111.2560 1126.9646 1158.2328 1197.3521 1239.2267 1288.6303 1323.8380 1353.3816 1369.1233 1443.1363 1454.7796 1645.2237 1656.9859 2006.9617 2996.6288 3049.3396 3067.0495 3076.4000 3081.9695 3169.2551 3446.1390 3492.8630 3573.7741
redmass: 5.6887 5.5407 2.9620 3.6094 2.9960 2.3900 2.0826 1.6459 2.2448 3.2018 4.6647 2.4523 1.7805 3.2558 1.2473 1.5945 3.4498 3.5080 1.2907 1.1872 2.4851 2.5714 1.5016 2.6114 2.2850 1.9233 1.8401 1.7045 1.3809 1.4710 1.3941 1.5817 1.4026 1.3899 1.4274 1.1044 1.0931 8.2312 9.9141 1.0594 1.0901 1.0942 1.0608 1.0925 1.1129 1.0450 1.0639 1.0974
irintensity: 0.8026 1.2595 0.1480 0.4058 4.8766 14.6588 15.9121 32.3179 10.1639 18.5656 30.6209 3.5608 13.7844 7.8533 158.3608 254.3277 30.8426 4.3693 85.6200 35.2354 1.5987 25.0997 0.4331 34.2666 207.1911 25.7984 2.2542 1.2840 6.2465 3.2576 1.7519 12.2997 0.2643 4.7594 10.9437 14.3939 48.2626 181.8359 51.8227 15.8484 4.3106 8.0019 4.2504 21.6204 6.5652 1.9152 12.6989 3.4191
temp: 298.150 k
press: 1.00000 atm
elementType: 8 8 7 6 6 6 6 6 6 1 1 1 1 1 1 1 1 1
symmnumber: 1
zpe: 370426.3 jmol-1
zpe.correction: 0.141088 hartree
zpe.thermalcorrener: 0.151528 hartree
zpe.thermalcorrenthalpy: 0.152472 hartree
zpe.thermalcorrgfe: 0.104115 hartree
zpe.sumelectzpe: -438.481729 hartree
zpe.sumelectthermal: -438.471289 hartree
zpe.sumelectthermalent: -438.470345 hartree
zpe.sumelectthermalfe: -438.518702 hartree
dipole: 0.5133 0.4903 -0.9522
dipole: 1.1876
quadrupole: -47.5096 -51.7796 -56.4493
quadrupole: -0.2040 -2.6628 -2.4341
quadrupole: 4.4032 0.1332 -4.5364 -0.2040 -2.6628 -2.4341
hfenergy: -438.622817 hartree
pointgroup: C01 [X(C6H9N1O2)]
dipole: -0.1886642 -0.1589011 -0.3968359 debye
dipolederiv: -0.4101892 -0.0159142 0.0124112 -0.0111758 -0.576077 -0.5507576 0.0411382 -0.4282788 -0.8928722 -0.3192244 -0.0321765 0.0689298 -0.094619 -0.677359 0.2166976 0.0906028 0.0294048 -0.8773836 -0.5628131 0.0944368 0.08737 0.1609832 -0.8352242 -0.0013769 0.1146405 -0.0091983 -0.2445524 0.4344689 -0.1604791 -0.0726785 -0.0873928 0.2171323 0.0067117 -0.0373867 0.0018665 0.2051457 0.115914 0.0622191 0.0083236 0.0000633 0.0777238 -0.0341621 -0.1122729 0.0610472 0.0532429 0.1110842 0.0581819 -0.0798639 0.2247594 1.0716063 0.1830524 -0.190058 0.2679757 1.3791065 -0.1892231 -0.0518932 -0.115939 -0.1261199 -0.1941323 0.0594338 -0.1876305 0.0693412 0.1125969 0.3375513 -0.2205337 0.2585151 -0.2435594 -0.0171958 -0.1314007 0.3716547 -0.1408743 0.0149125 -0.3213611 0.213125 0.0458188 0.2457807 0.0333365 -0.0295865 -0.0169089 -0.0152838 -0.3809399 0.0639638 0.0136726 -0.0032847 0.016956 0.0421352 0.0033796 -0.0102962 0.0117215 -0.1084787 -0.0117982 0.0182818 -0.0052714 0.0190563 -0.1191951 0.038254 0.0312874 0.0117129 0.0955867 0.0357074 0.0053633 0.0011007 -0.0062459 0.0879284 0.0391954 0.0113409 -0.0195909 -0.1039216 0.1824903 0.0432902 -0.0123612 0.0193292 0.3369424 0.1275724 0.0050273 0.0418193 0.0656127 0.0138917 -0.0243001 -0.0324243 -0.1521571 0.3097978 -0.0852771 0.0182804 -0.0840249 0.1610552 0.0644166 0.0598912 -0.0437686 0.0831191 0.137271 0.006837 0.007589 -0.0031376 -0.0751594 0.3995994 0.0025867 0.0086008 0.0041857 0.1096795 0.0834997 0.0260236 0.1306065 0.2600647 0.0848529 -0.0051478 -0.0452959 0.0193614 -0.0543174 0.0658518 -0.0700778 0.0650481 0.1649752 -0.0293314 -0.060604 -0.0801825 -0.0723243 0.0499476 0.0020756 -0.0929539 0.009845 0.1710087 unknown
polarizability: 98.2932969|-16.6701752|72.7968277|11.9120369|-3.4549859|67.9380222 unknown
InChI: InChI=1S/C6H9NO2/c1-2-3-4-5(7)6(8)9/h3,5,8H,1,4,7H2
charge 0 multiplicity 1
18 atoms
O  -1.132215 -1.611171 -1.176547
O  -1.349319 -1.341268 1.122947
N  -2.292269 1.403861 0.350694
C  -1.209904 0.673651 -0.325899
C  0.165397 1.259673 0.11325
C  -1.234947 -0.833916 -0.015246
C  1.348408 0.620689 -0.60057
C  2.399689 0.076733 0.008856
C  3.450667 -0.461065 0.620981
H  -1.321111 0.797557 -1.416689
H  0.116938 2.342076 -0.112491
H  0.274152 1.147175 1.207655
H  -2.290045 1.268355 1.368554
H  -3.221717 1.247472 -0.052435
H  1.317644 0.624967 -1.701505
H  -1.119775 -2.577627 -0.932637
H  3.472905 -1.523861 0.893463
H  4.334402 0.136699 0.87832
