program: Gaussian 09
title: 000152229
version: EM64L-G09RevD.01
frameworkgroup: C1[X(C13H15N)]
method: RPBEPBE
basis: SDD
operation: Freq
keyword: #pfreq=noraman
keyword: PBEPBE/SDD
title: #p freq=noraman PBEPBE/SDD
converged: YES YES NO NO
title: Mulliken charges:
elementType: N C C C C C C C C C C C C C H H H H H H H H H H H H H H H
charge: -0.414124 0.100089 0.384795 0.103880 -0.734619 -0.758641 0.210817 -0.430789 -0.083170 -0.387317 -0.359333 -0.275536 -0.218138 -0.598149 0.209264 0.231076 0.217173 0.221776 0.211019 0.233202 0.267568 0.228612 0.301094 0.244873 0.225677 0.218317 0.219741 0.207802 0.223042
chargesum: 0.00000
title: Mulliken charges with hydrogens summed into heavy atoms:
elementType: N C C C C C C C C C C C C C
charge: -0.113029 0.100089 0.384795 0.103880 -0.077107 -0.092644 0.210817 -0.163221 0.145443 -0.142443 -0.133656 -0.057219 0.001602 -0.167305
polarizability: 1.75790467e+02 4.24227916e+00 1.66612269e+02 1.46089438e+00 -4.42584223e+00 8.56305149e+01
1716.lowfreq: -8.9063 -2.5002 0.0006 0.0008 0.0009 7.5067 47.2099 82.0014 101.6847
frequency: 47.0294 81.9925 101.6732 150.1008 217.3267 219.6790 237.1145 273.0951 281.8570 295.5850 314.1755 343.0558 417.5854 423.6981 435.5689 479.5030 502.0402 559.4362 575.1637 577.9866 642.3200 646.5918 694.0030 748.4941 759.2311 768.4751 799.7802 807.6052 850.6963 867.7472 916.6149 929.4639 931.7495 933.7595 971.9960 998.1624 1010.7797 1013.0900 1014.8913 1044.2644 1100.8408 1124.9471 1149.9674 1162.8749 1177.2245 1225.6671 1247.2105 1254.2829 1290.8288 1300.8944 1332.2420 1370.9954 1380.9348 1389.7822 1417.2202 1419.7239 1457.1929 1465.7817 1469.5792 1481.3245 1482.4246 1489.5521 1548.6534 1581.7316 1629.8208 1647.9664 2973.7572 2981.5100 3068.5235 3073.7399 3075.3003 3085.0473 3089.0212 3099.1018 3122.6750 3134.1471 3152.2293 3166.9406 3196.2738 3230.9537 3613.9180
redmass: 3.5118 3.5628 3.0487 3.1495 3.3205 3.8908 1.1858 2.2027 1.0807 2.5880 2.2022 2.8437 3.3200 2.6859 3.4657 3.6497 1.2061 4.6997 3.0180 3.1189 3.5554 3.2465 2.0660 1.3408 5.2552 3.6113 1.5485 2.2656 1.4755 5.0528 1.9077 1.4172 1.4259 1.3869 1.2991 1.2571 1.4385 2.0576 1.9629 1.5706 1.6640 1.7268 1.9286 1.2655 1.8891 3.1478 1.5578 2.6960 1.8643 1.5126 2.2282 1.1931 2.3193 1.5572 2.4441 1.1966 3.5367 1.0636 1.0702 2.7655 1.0856 1.0669 5.5019 6.1697 6.8525 4.6817 1.0349 1.0356 1.0982 1.0842 1.0976 1.0988 1.0993 1.0712 1.0852 1.0899 1.0952 1.0985 1.1140 1.0974 1.0809
irintensity: 0.2443 0.3052 1.1454 0.2126 0.2748 7.6699 0.2262 0.5117 0.1408 0.3316 0.7777 0.4928 7.9657 1.7060 3.1132 2.7576 97.3535 0.2748 8.2109 2.7820 0.2184 5.8743 12.3849 108.9819 6.0881 11.4005 12.8784 3.0713 0.1667 0.9617 5.7847 24.3991 43.3444 4.6740 0.0486 3.9407 0.1025 37.9636 19.1404 7.8031 31.0839 28.3531 3.0026 9.6609 7.4777 3.3419 11.5235 0.2080 0.8475 0.8142 11.5416 21.3842 61.1691 5.1188 6.8293 9.8582 18.1840 0.6890 4.2097 5.0770 9.2837 11.8225 3.5953 1.0618 1.9830 19.3822 29.3603 29.7367 12.5119 37.9937 21.7798 48.9251 29.6411 6.4752 0.4155 16.7156 34.5908 18.8317 24.7918 1.3150 58.3946
temp: 298.150 k
press: 1.00000 atm
elementType: 7 6 6 6 6 6 6 6 6 6 6 6 6 6 1 1 1 1 1 1 1 1 1 1 1 1 1 1 1
symmnumber: 1
zpe: 637287.7 jmol-1
zpe.correction: 0.242730 hartree
zpe.thermalcorrener: 0.255679 hartree
zpe.thermalcorrenthalpy: 0.256623 hartree
zpe.thermalcorrgfe: 0.204123 hartree
zpe.sumelectzpe: -558.106034 hartree
zpe.sumelectthermal: -558.093086 hartree
zpe.sumelectthermalent: -558.092141 hartree
zpe.sumelectthermalfe: -558.144642 hartree
dipole: -0.2002 2.3689 -0.1294
dipole: 2.3808
quadrupole: -79.3708 -71.1256 -87.7753
quadrupole: -4.1268 1.4606 -1.9656
quadrupole: 0.0531 8.2983 -8.3514 -4.1268 1.4606 -1.9656
hfenergy: -558.3487642 hartree
pointgroup: C01 [X(C13H15N1)]
dipole: -0.0612752 -0.9332317 0.051981 debye
polarizability: 175.8589229|-4.1561843|166.4648687|-3.0110862|-4.3734576|85.7094591 unknown
InChI: InChI=1S/C13H15N/c1-4-13(2,3)11-9-14-12-8-6-5-7-10(11)12/h4-9,14H,1H2,2-3H3
charge 0 multiplicity 1
29 atoms
N  -1.149081 -2.149651 0.213927
C  2.032693 -0.15446 -0.199824
C  0.612315 -0.702212 -0.031747
C  -0.632535 0.061261 -0.046413
C  3.08358 -1.283395 0.027074
C  2.211427 0.403394 -1.639531
C  -1.716836 -0.875873 0.106024
C  0.247484 -2.039876 0.131995
C  2.282214 0.909706 0.877177
C  -0.946855 1.443668 -0.167282
C  -3.072637 -0.480361 0.132108
C  -2.295908 1.845796 -0.142048
C  -3.349712 0.895175 0.003557
C  2.726926 2.178128 0.696613
H  2.948553 -2.099226 -0.707922
H  4.102482 -0.876083 -0.094465
H  3.004163 -1.710753 1.043739
H  2.040093 -0.401934 -2.375688
H  3.235262 0.794255 -1.78829
H  1.493599 1.214013 -1.854436
H  0.87535 -2.925526 0.198657
H  2.082597 0.557246 1.901857
H  -1.664925 -3.017951 0.333932
H  -0.149869 2.188059 -0.257001
H  -3.882269 -1.209829 0.24871
H  -2.545502 2.909023 -0.231304
H  -4.389539 1.240718 0.019603
H  2.891637 2.846306 1.549587
H  2.935995 2.59098 -0.296807
