program: Gaussian 09
title: 000152226
version: EM64L-G09RevD.01
frameworkgroup: C1[X(C8H14O7)]
method: RPBEPBE
basis: SDD
operation: Freq
keyword: #pfreq=noraman
keyword: PBEPBE/SDD
title: #p freq=noraman PBEPBE/SDD
converged: YES YES NO NO
title: Mulliken charges:
elementType: O O O O O O O C C C C C C C C H H H H H H H H H H H H H H
charge: -0.253569 -0.239216 -0.461921 -0.471509 -0.446312 -0.473376 -0.173655 -0.145200 -0.157854 -0.097919 -0.091729 0.005344 0.153974 -0.214685 -0.679769 0.221055 0.244713 0.243630 0.240290 0.189245 0.368550 0.382304 0.364397 0.188414 0.234774 0.204768 0.232965 0.232205 0.400088
chargesum: 0.00000
title: Mulliken charges with hydrogens summed into heavy atoms:
elementType: O O O O O O O C C C C C C C C
charge: -0.253569 -0.239216 -0.093371 -0.089205 -0.081915 -0.073288 -0.173655 0.075854 0.086858 0.145711 0.148561 0.194589 0.153974 0.208503 -0.009831
polarizability: 1.36489798e+02 -2.40520242e+00 1.20354845e+02 3.40882941e-01 1.28936001e+00 7.77472133e+01
1716.lowfreq: -9.7480 -0.0008 -0.0005 -0.0002 6.2114 8.5544 23.4841 49.2267 59.9082
frequency: 23.4269 49.1954 59.8397 72.3953 96.8349 97.6970 159.7093 175.3206 219.7519 236.9837 256.4221 267.1770 281.4302 297.3538 319.6223 364.5102 379.7385 401.7388 417.3857 449.7807 460.9575 512.6915 524.9730 541.0850 568.7027 588.2588 609.7675 623.9016 687.9365 813.5367 838.9711 847.0592 899.1690 962.4784 975.3588 996.5265 1023.1486 1029.5002 1039.1299 1059.8582 1068.3328 1069.5812 1089.3976 1119.4444 1128.8791 1137.1958 1181.5556 1216.3711 1223.1282 1227.8840 1251.2340 1256.6379 1266.3592 1291.4050 1301.1749 1312.0888 1321.8193 1341.8768 1367.7964 1382.5460 1395.6948 1398.2235 1417.5275 1460.0859 1480.3624 1490.9627 1699.9653 2898.6173 2905.2028 2952.3105 2955.8410 2994.2606 2996.5360 3007.2703 3041.5317 3093.8264 3106.5787 3502.5619 3518.7622 3543.9878 3555.5826
redmass: 9.9876 4.2904 3.9866 2.1538 5.4433 5.7362 4.3869 5.3847 3.8017 1.2489 5.1543 4.3974 6.3996 4.1200 5.3976 5.4867 4.0334 2.5716 1.6187 1.3111 3.1916 2.9504 3.3578 1.3639 2.9642 2.8939 2.8587 2.1949 4.0894 1.1098 2.9663 6.9099 7.2907 6.1271 5.2288 5.7094 3.9858 3.2923 3.0770 2.4897 2.7960 3.8506 2.7136 2.0229 3.2981 1.5439 1.3444 1.2623 1.1961 1.2087 1.1528 1.2354 1.4755 1.2676 1.2172 1.2085 1.2380 1.3418 1.4036 1.7307 1.2742 1.4916 1.6801 1.0402 1.0536 1.0807 9.8558 1.0828 1.0793 1.0815 1.0629 1.0851 1.0362 1.0852 1.1003 1.0988 1.1015 1.0651 1.0640 1.0655 1.0655
irintensity: 3.3001 0.6216 1.5887 2.9368 3.1816 3.1660 2.9252 2.8888 3.4018 1.2769 10.1677 7.4941 1.4455 10.2807 7.6268 1.4395 8.3217 39.8957 100.4040 136.9903 45.1151 10.9753 21.9725 93.1639 62.5822 102.2783 53.8199 86.1325 25.3168 6.7021 11.6460 59.0915 170.4626 0.9466 285.8529 213.8613 49.7281 105.1796 67.3632 26.8457 9.5878 2.3401 92.7300 2.9794 123.0564 22.3327 12.8539 15.5497 20.8334 13.0760 0.6581 8.4888 16.6977 11.6903 40.0708 41.2503 45.7973 22.2762 18.8143 3.4094 29.0356 15.7801 9.2742 11.1973 5.0963 6.9486 217.7966 40.5468 27.5272 19.9713 61.5729 14.6841 23.4467 68.1055 17.2635 31.7218 35.0665 92.2031 22.5561 18.0375 24.3555
temp: 298.150 k
press: 1.00000 atm
elementType: 8 8 8 8 8 8 8 6 6 6 6 6 6 6 6 1 1 1 1 1 1 1 1 1 1 1 1 1 1
symmnumber: 1
zpe: 593346.1 jmol-1
zpe.correction: 0.225994 hartree
zpe.thermalcorrener: 0.242152 hartree
zpe.thermalcorrenthalpy: 0.243096 hartree
zpe.thermalcorrgfe: 0.181606 hartree
zpe.sumelectzpe: -838.572618 hartree
zpe.sumelectthermal: -838.556459 hartree
zpe.sumelectthermalent: -838.555515 hartree
zpe.sumelectthermalfe: -838.617005 hartree
dipole: -3.2377 -1.4799 1.2421
dipole: 3.7703
quadrupole: -75.5898 -93.3422 -87.5680
quadrupole: 1.6040 3.9339 -1.4476
quadrupole: 9.9102 -7.8422 -2.0680 1.6040 3.9339 -1.4476
hfenergy: -838.7986116 hartree
pointgroup: C01 [X(C8H14O7)]
dipole: 1.2682967 -0.5592731 -0.5282023 debye
polarizability: 136.3992728|2.6020703|120.4472019|-1.1606161|-0.9055767|77.7453817 unknown
InChI: InChI=1S/C8H14O7/c1-2-14-8-5(11)3(9)4(10)6(15-8)7(12)13/h3-6,8-12H,2H2,1H3
charge 0 multiplicity 1
29 atoms
O  -0.297708 -0.855356 0.064359
O  -2.477722 -0.021721 0.253524
O  1.214181 3.025354 0.420748
O  2.97803 0.956107 -0.430311
O  -1.517262 2.662578 -0.359686
O  3.201327 -1.732975 -0.0854
O  1.33081 -3.106951 0.010907
C  0.765474 1.788601 -0.223932
C  1.675918 0.607953 0.140735
C  -0.697642 1.592362 0.204929
C  1.050759 -0.680746 -0.468407
C  -1.230898 0.258612 -0.339389
C  1.803931 -1.973815 -0.152283
C  -3.204535 -1.166397 -0.357232
C  -4.556577 -1.256851 0.344164
H  0.801032 1.907607 -1.330616
H  1.732825 0.492297 1.243261
H  -0.759088 1.574418 1.312266
H  1.044184 -0.565379 -1.579885
H  -1.276186 0.273696 -1.456152
H  2.169226 3.152473 0.184798
H  3.589657 0.187227 -0.275438
H  -1.09711 3.519883 -0.087918
H  -3.322622 -0.971867 -1.444906
H  -2.604335 -2.08474 -0.218535
H  -5.148725 -2.090363 -0.075627
H  -4.418651 -1.434985 1.424241
H  -5.124452 -0.319711 0.215988
H  3.676958 -2.589311 0.090796
