program: Gaussian 09
title: 000152225
version: EM64L-G09RevD.01
frameworkgroup: C1[X(C8H14O4S2)]
method: RPBEPBE
basis: SDD
operation: Freq
keyword: #p
keyword: freq=noraman
keyword: PBEPBE/SDD
title: #p freq=noraman PBEPBE/SDD
converged: YES YES NO NO
title: Mulliken charges:
elementType: S S O O O O C C C C C C C C H H H H H H H H H H H H H H
charge: 0.104657 0.054306 -0.238500 -0.251614 -0.238428 -0.261776 -0.775633 -0.454484 0.441703 0.325267 -0.224125 -0.227789 -0.670043 -0.672995 0.263818 0.276194 0.234299 0.230666 0.112515 0.140649 0.241288 0.228668 0.210823 0.233604 0.238554 0.213193 0.228541 0.236639
chargesum: 0.00000
title: Mulliken charges with hydrogens summed into heavy atoms:
elementType: S S O O O O C C C C C C C C
charge: 0.217172 0.194955 -0.238500 -0.251614 -0.238428 -0.261776 -0.775633 0.085529 0.441703 0.325267 0.240840 0.242168 0.012937 0.005379
polarizability: 1.61557328e+02 9.10506613e+00 1.30044214e+02 6.00410436e+00 -2.12243113e+00 1.17822055e+02
1716.lowfreq: -5.9480 0.0021 0.0028 0.0035 1.8084 9.2968 23.6053 36.3106 53.7348
frequency: 23.4776 36.2954 53.7335 64.9920 82.4971 91.1969 97.3241 123.7173 161.3740 176.1193 188.0444 198.2287 227.8471 238.3543 251.2705 256.9760 285.5837 288.1613 338.2028 354.5740 386.1529 417.6100 471.7080 502.8714 583.0301 620.9886 673.7891 717.1240 774.3081 799.0471 799.5206 802.8801 825.8140 848.8936 878.0854 908.0564 943.1541 1007.7321 1017.5685 1025.0029 1088.7323 1114.8927 1115.2400 1134.7499 1136.0344 1163.7231 1206.1863 1249.1740 1251.8041 1265.2459 1321.3135 1357.3646 1362.1355 1401.5363 1402.8880 1424.3776 1463.1295 1463.9732 1471.6272 1472.2958 1485.0598 1485.5737 1597.3052 1601.0143 2190.1540 2414.0195 2997.7098 2998.6770 3011.5311 3015.5109 3016.7281 3072.5353 3077.2308 3094.4190 3095.4173 3096.8191 3111.4608 3112.4820
redmass: 3.7229 3.1772 2.3248 4.5743 5.0528 3.2027 4.3118 5.9066 2.8767 3.6649 1.9612 3.9931 2.8039 2.1740 1.4325 1.5577 6.5177 4.0484 3.9913 4.2914 3.8901 5.2753 1.2124 2.5912 4.5010 6.6411 5.9681 5.8901 4.0310 1.1451 1.1422 2.9705 2.1925 1.8479 2.0028 3.3866 2.3553 2.4319 2.2232 2.5988 5.2828 2.2620 2.2362 1.4588 1.4682 2.3827 3.5117 1.1378 1.1493 1.6002 1.4913 1.4141 1.4830 1.2712 1.2640 1.0829 1.0394 1.0397 1.0685 1.0679 1.0646 1.0644 9.1652 10.1967 1.0430 1.0380 1.0359 1.0361 1.0580 1.0621 1.0585 1.1071 1.1064 1.0985 1.0985 1.0990 1.1032 1.1026
irintensity: 1.0559 0.5690 1.1492 0.6226 1.8338 2.9239 1.7750 0.1305 2.0270 1.9329 19.7469 6.2827 12.4962 7.3592 0.4206 2.4132 9.4518 3.8438 10.6572 40.1111 7.3044 0.0946 15.1445 35.5447 8.1434 15.5902 9.1304 0.6941 15.7485 5.7128 4.3219 2.7247 25.3322 6.9453 30.0158 89.3148 19.2269 25.6191 37.1939 107.8686 153.8738 4.1231 1.5570 5.6608 4.5273 237.7781 306.9356 0.2709 4.4291 81.0613 116.1840 1.5458 9.5785 22.1545 24.0870 20.1432 12.8327 11.9935 2.8046 6.5604 15.7509 14.1123 104.3719 287.9709 181.8225 26.3738 21.2514 17.9061 16.5206 2.4995 15.1053 7.3335 3.9958 26.7669 26.6748 0.7827 40.8919 35.2577
temp: 298.150 k
press: 1.00000 atm
elementType: 16 16 8 8 8 8 6 6 6 6 6 6 6 6 1 1 1 1 1 1 1 1 1 1 1 1 1 1
symmnumber: 1
zpe: 549572.7 jmol-1
zpe.correction: 0.209321 hartree
zpe.thermalcorrener: 0.227075 hartree
zpe.thermalcorrenthalpy: 0.228019 hartree
zpe.thermalcorrgfe: 0.161878 hartree
zpe.sumelectzpe: -1409.139551 hartree
zpe.sumelectthermal: -1409.121798 hartree
zpe.sumelectthermalent: -1409.120853 hartree
zpe.sumelectthermalfe: -1409.186995 hartree
dipole: 1.5600 1.6146 -1.4054
dipole: 2.6487
quadrupole: -85.1380 -90.8666 -101.8280
quadrupole: -6.2376 -1.5086 5.0169
quadrupole: 7.4729 1.7443 -9.2171 -6.2376 -1.5086 5.0169
hfenergy: -1409.3488725 hartree
pointgroup: C01 [X(C8H14O4S2)]
dipole: 0.6679154 0.7264518 -0.3347596 debye
polarizability: 159.3344409|7.1535708|130.1770684|12.7142008|1.2502019|119.9120881 unknown
InChI: InChI=1S/C8H14O4S2/c1-3-11-6(9)5-8(13,14)7(10)12-4-2/h13-14H,3-5H2,1-2H3
charge 0 multiplicity 1
28 atoms
S  -1.82148 -1.191844 -2.217857
S  -1.271247 -2.046618 0.695887
O  -2.46838 0.903524 -0.328161
O  2.684211 0.302361 -0.329464
O  -0.283342 1.402204 0.297115
O  1.622988 -0.967549 1.296279
C  -0.777777 -0.801356 -0.675411
C  0.727007 -0.890017 -1.023376
C  -1.129713 0.612073 -0.19106
C  1.677707 -0.526314 0.116127
C  -2.918095 2.229624 0.209062
C  3.677031 0.756152 0.700695
C  -4.415969 2.319873 -0.055506
C  4.667828 1.66375 -0.018355
H  0.946721 -1.931409 -1.326273
H  0.941937 -0.230162 -1.87969
H  -2.670464 2.258631 1.285488
H  -2.341916 3.020906 -0.303577
H  -1.237009 -2.437724 -2.403256
H  -0.070428 -1.829465 1.399354
H  3.115508 1.279066 1.494833
H  4.153218 -0.139005 1.13953
H  -4.804322 3.280913 0.328201
H  -4.629813 2.263344 -1.136205
H  -4.953394 1.499352 0.448798
H  5.41853 2.038457 0.701114
H  5.196733 1.11945 -0.819342
H  4.152431 2.530383 -0.465551
