program: Gaussian 09
title: 000152223
version: EM64L-G09RevD.01
frameworkgroup: C1[X(C8H16O3S)]
method: RPBEPBE
basis: SDD
operation: Freq
keyword: #p
keyword: freq=noraman
keyword: PBEPBE/SDD
title: #p freq=noraman PBEPBE/SDD
converged: YES YES NO NO
title: Mulliken charges:
elementType: S O O O C C C C C C C C H H H H H H H H H H H H H H H H
charge: 0.210500 -0.431311 -0.402564 -0.233573 -0.329454 -0.335424 -0.688308 -0.351295 -0.660431 -0.091804 -0.692279 0.144213 0.209095 0.210678 0.186395 0.185363 0.248824 0.248020 0.196803 0.196871 0.267548 0.261025 0.267124 0.209471 0.209466 0.217955 0.358454 0.388640
chargesum: 0.00000
title: Mulliken charges with hydrogens summed into heavy atoms:
elementType: S O O O C C C C C C C C
charge: 0.210500 -0.072857 -0.013924 -0.233573 0.090319 0.036334 -0.191464 0.042379 -0.131859 0.175319 -0.055387 0.144213
polarizability: 1.65922311e+02 -8.27816515e-01 1.05590719e+02 6.83018387e+00 -1.04884666e-01 8.35169521e+01
1716.lowfreq: -7.0308 -1.3293 0.0004 0.0020 0.0023 6.0904 11.5059 32.2164 36.8358
frequency: 10.6059 32.1210 36.8258 48.4772 58.5661 88.2022 103.8462 130.3295 136.9652 168.4439 188.6199 226.4761 241.5064 285.8737 341.4366 348.7210 375.0345 433.6622 479.9740 574.6370 606.5688 657.0489 700.4645 730.7603 741.4861 759.2483 825.6882 832.0411 884.1940 894.7415 946.7404 983.6469 1005.6270 1040.6017 1057.9308 1058.3031 1070.6278 1073.8458 1111.4714 1159.7675 1195.2175 1207.4052 1225.9718 1252.8983 1256.8572 1282.8088 1287.3975 1291.3181 1293.1431 1322.5461 1335.5974 1351.4015 1386.4883 1388.3232 1434.6818 1451.6261 1466.4694 1470.5428 1476.9001 1479.9960 1488.4347 1646.4557 2956.5210 2969.8819 2972.5678 2979.9593 2997.3736 2997.5435 3013.3132 3021.8514 3040.4628 3060.6829 3068.9250 3072.6225 3074.3579 3094.4865 3500.7018 3511.7623
redmass: 5.8979 2.1073 3.6384 6.9340 3.8099 3.2983 1.9493 2.2283 3.4850 5.5553 4.6957 1.1200 3.0207 4.0124 1.4964 3.6006 4.1282 3.1377 3.4417 1.6647 3.9250 2.5862 5.4655 1.0686 5.6202 1.1071 3.0227 1.2039 2.4124 1.8234 1.2018 2.5775 4.1506 3.6698 1.6521 1.6258 2.4580 2.5149 2.2957 1.1336 1.6204 1.2007 1.2546 1.2830 1.3053 1.3016 1.0525 1.2017 1.6425 1.3181 1.3973 1.6035 1.3562 1.2155 1.0961 1.0889 1.0659 1.0712 1.0426 1.0707 1.0910 8.9872 1.0586 1.0587 1.0368 1.0592 1.0663 1.0876 1.0565 1.1023 1.1045 1.0858 1.1017 1.0992 1.1079 1.1069 1.0653 1.0642
irintensity: 0.1283 0.3498 0.4894 3.3385 0.3883 1.8623 0.0240 0.1639 0.8971 1.9460 3.4396 0.0108 38.5182 20.8092 107.0566 1.8710 6.1839 2.4184 21.3414 90.2692 22.1883 91.0719 6.3524 11.8819 11.5736 0.8712 13.2240 4.2181 15.7412 2.8558 0.1594 70.4487 0.8759 189.6699 2.8452 8.6610 52.3946 27.7810 14.0896 16.8688 0.0687 9.3747 2.8541 0.0549 16.0428 24.8400 1.1510 8.3942 50.9629 23.1816 7.2875 0.1762 26.0976 10.8725 5.0929 4.1823 0.8121 1.2265 12.7202 2.0211 19.5688 243.4321 7.5532 38.3887 35.6844 34.7688 35.7959 13.3301 16.9064 6.3272 25.7282 5.0562 41.6039 52.7016 106.6027 12.9843 28.4098 27.8910
temp: 298.150 k
press: 1.00000 atm
elementType: 16 8 8 8 6 6 6 6 6 6 6 6 1 1 1 1 1 1 1 1 1 1 1 1 1 1 1 1
symmnumber: 1
zpe: 608759.4 jmol-1
zpe.correction: 0.231864 hartree
zpe.thermalcorrener: 0.247706 hartree
zpe.thermalcorrenthalpy: 0.248650 hartree
zpe.thermalcorrgfe: 0.184656 hartree
zpe.sumelectzpe: -937.187221 hartree
zpe.sumelectthermal: -937.171379 hartree
zpe.sumelectthermalent: -937.170435 hartree
zpe.sumelectthermalfe: -937.234429 hartree
dipole: -1.0913 3.9301 0.8432
dipole: 4.1651
quadrupole: -79.5765 -81.7502 -81.5636
quadrupole: 10.8702 0.3599 -1.6519
quadrupole: 1.3869 -0.7868 -0.6002 10.8702 0.3599 -1.6519
hfenergy: -937.419085 hartree
pointgroup: C01 [X(C8H16O3S1)]
dipole: -0.4121643 1.5390772 0.3828943 debye
polarizability: 166.0681834|-1.5004396|105.5976273|5.7127505|0.5151151|83.364171 unknown
InChI: InChI=1S/C8H16O3S/c1-2-3-4-5-12-6-7(9)8(10)11/h7,9-10H,2-6H2,1H3
charge 0 multiplicity 1
28 atoms
S  0.017137 -1.138823 -0.045518
O  3.105386 -1.731188 -0.406874
O  3.660795 1.886963 -0.453399
O  4.88008 0.170442 0.539235
C  -2.736086 -0.54253 -0.030597
C  -3.915747 0.438653 0.173769
C  -1.377186 0.118258 0.256161
C  -5.291606 -0.214479 -0.0943
C  1.481463 -0.045068 0.452637
C  2.689576 -0.338576 -0.468316
C  -6.468222 0.764798 0.106825
C  3.863848 0.564141 -0.077464
H  -2.749562 -0.924284 -1.071135
H  -2.865806 -1.420371 0.632997
H  -3.790541 1.314175 -0.4968
H  -3.894997 0.832373 1.211522
H  -1.318485 0.453207 1.307411
H  -1.20866 0.983726 -0.410257
H  -5.310735 -0.610719 -1.129838
H  -5.415853 -1.088856 0.57617
H  1.170528 1.007154 0.333049
H  1.738798 -0.240606 1.50822
H  2.401866 -0.137786 -1.514242
H  -6.492279 1.149032 1.144172
H  -6.380037 1.634882 -0.570944
H  -7.439345 0.276698 -0.094815
H  3.820075 -1.815083 0.280692
H  4.432194 2.44767 -0.16646
