program: Gaussian 09
title: 000152220
version: EM64L-G09RevD.01
frameworkgroup: C1[X(C19H29NO3)]
method: RPBEPBE
basis: SDD
operation: Freq
keyword: #p
keyword: freq=noraman
keyword: PBEPBE/SDD
title: #p freq=noraman PBEPBE/SDD
converged: YES YES NO NO
title: Mulliken charges:
elementType: O O O N C C C C C C C C C C C C C C C C C C C H H H H H H H H H H H H H H H H H H H H H H H H H H H H H
charge: -0.293419 -0.245104 -0.410160 -0.356847 -0.200431 -0.387849 -0.394494 -0.488905 -0.736140 0.259171 -0.151806 -0.081640 -0.580989 -0.233072 0.530943 -0.703424 -0.690087 -0.500509 -0.444204 0.227428 -0.356987 0.161161 -0.542404 0.207111 0.200176 0.223459 0.214982 0.219116 0.194543 0.204179 0.252852 0.206749 0.218655 0.238899 0.293913 0.197558 0.222499 0.255927 0.207271 0.211588 0.233760 0.197603 0.212268 0.211313 0.209765 0.289502 0.229811 0.217894 0.351095 0.223375 0.228577 0.245330
chargesum: 0.00000
title: Mulliken charges with hydrogens summed into heavy atoms:
elementType: O O O N C C C C C C C C C C C C C C C C C C C
charge: -0.293419 -0.245104 -0.059065 -0.062934 0.006680 0.035786 0.039605 -0.090183 -0.057883 0.259171 0.087093 0.115918 -0.102563 -0.025801 0.530943 -0.060473 -0.056742 -0.211007 -0.214394 0.227428 -0.139094 0.161161 0.154879
polarizability: 2.54320859e+02 8.71532172e+00 1.90780587e+02 -1.47753577e+01 8.40767720e+00 2.15839021e+02
1716.lowfreq: -13.2109 -9.5281 -4.0184 -0.0007 -0.0006 -0.0004 6.9568 17.8605 24.4164
frequency: -3.9099 17.6782 24.3271 30.2880 35.7400 38.4517 45.0385 85.5230 101.1672 116.6975 119.4593 140.7498 148.9540 163.4199 173.6047 181.2522 199.8049 213.8568 217.3149 233.3674 251.0070 257.4116 269.3127 281.1043 299.0812 317.2076 322.0520 339.0606 351.6681 365.2342 377.0563 409.4283 421.6045 448.4127 456.5538 497.0297 521.8706 531.7572 539.9768 554.7096 567.3125 629.4159 644.2403 706.9213 727.0936 736.2899 756.7202 770.0186 783.1781 797.3434 804.9357 809.2000 852.7112 881.6676 905.4402 907.2105 912.7370 917.3467 919.3265 946.4018 956.4834 981.1500 985.4561 994.0307 1000.5140 1017.2490 1026.3301 1048.8570 1070.7411 1086.5923 1098.0949 1110.5362 1115.0425 1125.6290 1141.9263 1147.1525 1161.9244 1166.7663 1173.7094 1187.3199 1198.6191 1210.7243 1231.9262 1243.1651 1248.2757 1270.2530 1273.0471 1283.6126 1295.8627 1301.5436 1303.7827 1316.2179 1321.9180 1335.2012 1341.5094 1353.4368 1364.4208 1372.7299 1389.2013 1393.8569 1409.4805 1413.0001 1443.6948 1450.8602 1453.8739 1455.2946 1465.0334 1465.6700 1466.7939 1469.8599 1470.2593 1473.4976 1480.5340 1481.0118 1487.5676 1490.8603 1513.4973 1601.1921 1604.7701 1615.4422 1680.9682 2932.8017 2949.8827 2954.4630 2961.3407 2968.2091 2971.0156 2976.1629 2980.7958 2989.3904 3008.7480 3009.8368 3014.2194 3045.1913 3047.7954 3049.4505 3064.4499 3066.5738 3072.1609 3072.4228 3079.4699 3079.7927 3085.3710 3101.2969 3109.6659 3128.1330 3137.6898 3150.4327 3543.5229 3573.6337
redmass: 4.0724 3.1004 4.6887 3.4314 4.5220 4.9604 5.0473 3.9679 3.1697 4.1052 2.5279 2.2741 3.2100 3.9373 2.5083 2.2053 1.1792 2.4915 1.0695 2.1058 2.5918 1.8298 1.5938 2.1845 2.6921 2.9100 3.0621 2.6973 1.5009 2.2486 2.3124 3.0418 2.5267 3.3388 3.9643 4.3171 3.1590 2.8346 3.1033 1.7464 2.3216 3.1525 4.3318 4.8329 2.3052 3.2192 1.9979 3.1933 2.4239 1.6130 3.0113 1.9416 2.1277 1.5659 1.4868 1.2288 2.4387 3.2119 1.7858 1.9201 1.4088 1.1676 1.7235 2.4762 2.8693 1.9539 2.9094 2.0350 1.6717 2.1286 1.8903 1.2647 2.0408 1.7601 2.5476 1.3552 1.4959 1.5707 1.5652 1.7140 1.7910 1.3881 1.4807 1.6655 1.4918 3.3861 1.2796 1.3028 1.2546 1.3863 1.2790 1.2928 1.6270 1.4306 1.3467 1.4699 1.4796 1.2095 1.2067 1.2244 5.1425 2.5839 1.3627 1.1688 1.0761 1.0915 1.0500 1.0570 1.0449 1.0673 1.0560 1.0931 1.4364 1.1187 1.1151 1.0546 2.9557 6.3674 5.9714 6.7939 6.4559 1.0818 1.0606 1.0712 1.0332 1.0347 1.0702 1.0363 1.0621 1.0377 1.0966 1.0602 1.0994 1.1030 1.0904 1.1033 1.1001 1.0998 1.0996 1.1032 1.0988 1.0999 1.0892 1.0989 1.0876 1.0996 1.0957 1.0921 1.0776 1.0659
irintensity: 0.8484 0.5196 0.3084 1.4161 0.3146 1.7699 3.7277 4.6916 8.6909 4.9174 0.3785 0.6300 1.0133 4.1054 0.8735 0.8624 0.4788 1.0719 0.0306 1.4041 6.5263 4.7242 0.3317 5.5141 1.2968 1.6069 1.5780 24.8666 88.8888 48.1833 1.5103 4.6764 1.3701 2.5270 1.4565 2.2932 0.4923 32.6554 3.7493 106.4304 0.6008 13.2228 25.4019 13.7939 6.7328 19.7099 4.3697 13.8005 11.0475 31.1449 0.9000 0.9809 5.0803 31.8071 3.0780 3.6526 2.4822 2.0677 0.8779 1.5857 0.5625 30.1036 5.8314 23.5239 28.7541 8.1591 0.6527 4.2252 3.8807 204.0039 4.3927 0.1523 2.7100 4.4007 3.7351 17.0498 7.7588 2.5825 55.0649 2.1233 66.4624 12.4966 60.8651 12.1513 35.5493 132.3977 4.7335 2.6753 2.2149 9.0480 0.9532 2.3581 4.9877 1.2822 3.8062 9.7761 3.6494 17.1417 25.9203 14.7689 13.7349 28.0316 18.5768 21.8460 8.4770 14.2117 9.7848 15.2377 4.8676 39.1075 1.1716 5.2741 87.9696 40.6632 42.0469 19.4099 95.6997 106.3995 43.3384 6.1420 0.3400 32.0783 36.0604 19.9015 45.7105 33.9574 35.7710 21.5154 33.1107 38.7173 25.5422 43.2296 9.5303 77.3068 41.7401 47.9183 3.9560 42.5394 95.8257 4.2230 19.5685 45.3156 37.1233 19.8737 18.0294 22.3284 16.8869 1.0332 11.6239 35.2750
temp: 298.150 k
press: 1.00000 atm
elementType: 8 8 8 7 6 6 6 6 6 6 6 6 6 6 6 6 6 6 6 6 6 6 6 1 1 1 1 1 1 1 1 1 1 1 1 1 1 1 1 1 1 1 1 1 1 1 1 1 1 1 1 1
symmnumber: 1
zpe: 1161787.1 jmol-1
zpe.correction: 0.442501 hartree
zpe.thermalcorrener: 0.467945 hartree
zpe.thermalcorrenthalpy: 0.468889 hartree
zpe.thermalcorrgfe: 0.385594 hartree
zpe.sumelectzpe: -1020.037310 hartree
zpe.sumelectthermal: -1020.011866 hartree
zpe.sumelectthermalent: -1020.010922 hartree
zpe.sumelectthermalfe: -1020.094217 hartree
dipole: 0.4179 1.1576 -3.6099
dipole: 3.8139
quadrupole: -138.9001 -143.1553 -129.1282
quadrupole: -7.2545 -4.4914 5.6931
quadrupole: -1.8389 -6.0941 7.9330 -7.2545 -4.4914 5.6931
hfenergy: -1020.4798111 hartree
pointgroup: C01 [X(C19H29N1O3)]
dipole: -0.930548 -0.4034013 1.105831 debye
polarizability: 186.265021|-5.1616122|256.2553973|-1.2656722|-11.5636518|218.4200485 unknown
InChI: InChI=1S/C19H29NO3/c1-14(2)8-6-5-7-9-15(3)19(22)20-13-16-10-11-17(21)18(12-16)23-4/h6,8,10-12,14-15,20-21H,5,7,9,13H2,1-4H3
charge 0 multiplicity 1
52 atoms
O  0.934613 3.311927 0.20724
O  2.282829 -1.578707 -1.37003
O  2.181656 -3.69419 0.263245
N  0.090727 2.151229 2.035552
C  -1.518029 3.325529 0.574988
C  -2.173736 2.188785 -0.278055
C  -1.509606 1.924878 -1.646617
C  -2.165866 0.740103 -2.410172
C  -1.575624 4.703302 -0.11789
C  -0.061018 2.95158 0.913402
C  -1.997061 -0.601197 -1.720395
C  -2.911345 -2.812251 -0.742117
C  1.401106 1.590946 2.437547
C  -3.01446 -1.447743 -1.411257
C  1.637815 0.18067 1.907655
C  -1.472167 -3.229358 -0.372337
C  -3.839794 -2.860775 0.504446
C  1.878853 -0.006678 0.519526
C  1.595713 -0.943628 2.757824
C  2.057983 -1.297839 -0.01886
C  1.779537 -2.244062 2.228089
C  2.006151 -2.431848 0.850301
C  2.396165 -0.43368 -2.279018
H  -2.089766 3.381214 1.5258
H  -3.237437 2.461161 -0.438838
H  -2.177471 1.244328 0.302452
H  -0.430669 1.719084 -1.501734
H  -1.569093 2.833223 -2.276512
H  -3.244573 0.946636 -2.563067
H  -1.7081 0.689467 -3.421178
H  -0.87861 4.737037 -0.971367
H  -2.599312 4.911755 -0.479574
H  -1.281941 5.509967 0.577419
H  -0.962349 -0.887778 -1.475716
H  -0.74646 1.814663 2.51516
H  -3.306705 -3.558165 -1.468114
H  1.461983 1.602501 3.540982
H  2.159461 2.287803 2.038732
H  -4.042999 -1.135663 -1.663651
H  -1.034048 -2.532626 0.366955
H  -0.804485 -3.247831 -1.252156
H  -1.470004 -4.241475 0.073659
H  -3.478919 -2.160362 1.280856
H  -4.877539 -2.577926 0.246089
H  -3.860358 -3.877386 0.93979
H  1.916439 0.878489 -0.123613
H  1.422375 -0.815485 3.832685
H  1.74716 -3.11789 2.892356
H  2.103008 -4.402445 0.950316
H  1.459004 0.156239 -2.308005
H  3.23608 0.227086 -1.990504
H  2.588584 -0.875315 -3.267486
