program: Gaussian 09
title: 000152215
version: EM64L-G09RevD.01
frameworkgroup: C1[X(C14H16N2)]
method: RPBEPBE
basis: SDD
operation: Freq
keyword: #pfreq=noraman
keyword: PBEPBE/SDD
title: #p freq=noraman PBEPBE/SDD
converged: YES YES NO NO
title: Mulliken charges:
elementType: N N C C C C C C C C C C C C C C H H H H H H H H H H H H H H H H
charge: -0.077875 -0.409429 -0.524415 0.320371 -0.393885 -0.382773 0.223021 -0.406204 0.121250 0.226194 -0.413587 -0.618284 -0.381881 -0.362819 -0.270810 -0.218549 0.210725 0.235534 0.184438 0.212815 0.222045 0.183285 0.221868 0.272990 0.184880 0.220872 0.225804 0.303910 0.224023 0.226141 0.219403 0.220942
chargesum: 0.00000
title: Mulliken charges with hydrogens summed into heavy atoms:
elementType: N N C C C C C C C C C C C C C C
charge: -0.077875 -0.105519 -0.078157 0.320371 0.003368 0.022557 0.223021 -0.184335 0.121250 0.226194 -0.140598 0.013273 -0.157857 -0.136678 -0.051407 0.002393
polarizability: 2.35179675e+02 1.54394666e+01 1.68646163e+02 7.29751176e+00 -2.59739062e+00 9.45577452e+01
1716.lowfreq: -12.5823 -3.8970 -3.6892 -0.0009 -0.0007 -0.0005 38.3072 53.1625 73.6222
frequency: 37.9180 53.1486 73.6038 134.0471 192.7109 209.0028 221.9353 232.6303 240.2648 283.3448 309.6649 343.8600 381.4528 421.3553 438.9839 492.1387 507.4545 516.7815 555.3263 574.5451 575.6419 636.4491 644.6463 731.6918 746.6358 752.3892 765.0468 778.3311 800.4137 827.8531 847.6310 865.7160 910.8664 929.1635 936.0478 960.0133 968.6424 989.1244 1015.3516 1034.3801 1062.3826 1078.0202 1092.3709 1102.2756 1113.3290 1137.2188 1146.8752 1167.6507 1181.1723 1201.9413 1238.8005 1249.1036 1260.7490 1283.6260 1292.9372 1306.5216 1335.2296 1341.2423 1360.4491 1373.6849 1389.6362 1417.8371 1429.4414 1448.0179 1456.3942 1457.8658 1463.0058 1476.9942 1480.1763 1481.1162 1546.6443 1581.2247 1629.5888 1670.2459 2779.8539 2830.3753 2848.9161 2969.0495 2985.2538 3013.3431 3029.2043 3043.3733 3072.8098 3115.5191 3123.3476 3132.9439 3147.8595 3163.5102 3226.1890 3611.5683
redmass: 3.2748 3.4898 4.1863 3.5607 1.6165 4.0558 3.9646 1.7003 2.1864 3.6631 2.4211 2.2969 3.5103 2.8510 3.1214 3.2506 3.0308 1.4337 4.7019 3.8314 3.3279 3.7549 3.8979 4.6707 1.3266 3.9600 3.7178 2.1131 1.4281 1.3765 1.5116 4.9277 4.6586 1.3890 2.2597 2.1611 1.3015 1.9031 2.1312 2.0708 2.3704 1.5871 1.9958 1.8976 1.3452 1.4595 2.0921 1.1054 1.1688 1.5968 1.6310 1.7621 2.4509 1.6833 1.9492 1.4569 1.8029 1.6634 2.2943 1.4531 4.2238 2.4369 1.1754 1.1312 1.0853 3.3204 1.0689 1.0997 1.0622 2.9851 6.0350 6.1654 6.9205 7.2198 1.0718 1.0683 1.0602 1.0830 1.0633 1.0715 1.0876 1.0964 1.1008 1.0909 1.0850 1.0890 1.0948 1.1000 1.0981 1.0808
irintensity: 0.2176 1.5687 0.8715 0.3181 2.6592 1.1450 8.8010 0.6559 1.0797 1.4187 7.7125 1.9450 2.1622 12.5345 1.0023 1.1503 21.8823 73.2753 1.5841 7.1303 4.7660 1.1952 4.1125 8.8322 104.1109 4.5377 9.9495 4.9901 26.3516 12.3881 0.1032 0.1581 15.6910 1.3244 6.1598 17.1642 0.1916 5.7264 12.7049 18.1155 4.8110 20.9858 12.3366 29.1000 10.0189 0.3706 17.1405 0.8782 3.3351 3.5936 3.3583 11.7172 20.4161 14.1734 4.5871 10.0872 14.2849 9.6404 4.0067 16.6077 50.7099 6.5279 3.4695 6.1570 16.8301 26.2819 8.3178 13.0724 8.2256 3.6097 20.1821 0.2216 1.7956 3.2161 96.8575 56.0243 228.1627 42.2448 23.1643 55.9327 49.8035 27.3152 33.5721 20.3224 1.1737 8.5397 41.7523 27.2237 0.4101 63.1597
temp: 298.150 k
press: 1.00000 atm
elementType: 7 7 6 6 6 6 6 6 6 6 6 6 6 6 6 6 1 1 1 1 1 1 1 1 1 1 1 1 1 1 1 1
symmnumber: 1
zpe: 701508.7 jmol-1
zpe.correction: 0.267191 hartree
zpe.thermalcorrener: 0.280897 hartree
zpe.thermalcorrenthalpy: 0.281841 hartree
zpe.thermalcorrgfe: 0.226577 hartree
zpe.sumelectzpe: -651.416007 hartree
zpe.sumelectthermal: -651.402300 hartree
zpe.sumelectthermalent: -651.401356 hartree
zpe.sumelectthermalfe: -651.456620 hartree
dipole: -0.3768 1.5688 0.1922
dipole: 1.6248
quadrupole: -82.9320 -81.0611 -100.7447
quadrupole: -8.2492 3.9646 -0.7997
quadrupole: 5.3140 7.1849 -12.4988 -8.2492 3.9646 -0.7997
hfenergy: -651.6831973 hartree
pointgroup: C01 [X(C14H16N2)]
dipole: 0.1469589 -0.5353156 0.3169991 debye
polarizability: 234.8821925|9.4682942|158.020342|-16.0219949|-25.7866166|105.481049 unknown
InChI: InChI=1S/C14H16N2/c1-16-8-6-11(7-9-16)13-10-15-14-5-3-2-4-12(13)14/h2-6,10,15H,7-9H2,1H3
charge 0 multiplicity 1
32 atoms
N  -3.899828 0.11108 -0.232963
N  2.214929 -1.97259 0.463737
C  -1.597499 0.497275 -1.058274
C  -1.084257 -0.288787 0.144692
C  -2.972881 1.129314 -0.776001
C  -3.446352 -0.401401 1.078347
C  0.344612 -0.673052 0.191013
C  -1.958683 -0.67408 1.119944
C  1.5283 0.141197 -0.080902
C  2.682553 -0.704313 0.099168
C  0.816201 -1.949762 0.518146
C  -5.302127 0.558231 -0.195424
C  1.742144 1.508342 -0.409204
C  4.0059 -0.239364 -0.065574
C  3.058398 1.980565 -0.574636
C  4.180466 1.115377 -0.411358
H  -0.877583 1.284829 -1.348635
H  -1.678187 -0.186291 -1.92648
H  -2.848607 1.993147 -0.070296
H  -3.405577 1.528688 -1.712267
H  -4.002926 -1.335873 1.300354
H  -3.702213 0.313313 1.910997
H  -1.585838 -1.198701 2.009795
H  0.24215 -2.846234 0.745102
H  -5.474013 1.430817 0.487135
H  -5.947783 -0.270645 0.148698
H  -5.630072 0.846923 -1.210073
H  2.798321 -2.787627 0.637803
H  0.898566 2.197581 -0.518885
H  4.868498 -0.900796 0.074533
H  3.228236 3.032732 -0.829096
H  5.192451 1.512307 -0.548995
