program: Gaussian 09
title: 000152198
version: EM64L-G09RevD.01
frameworkgroup: C1[X(C15H18N4O3)]
method: RPBEPBE
basis: SDD
operation: Freq
keyword: #p
keyword: freq=noraman
keyword: PBEPBE/SDD
title: #p freq=noraman PBEPBE/SDD
converged: YES YES NO NO
title: Mulliken charges:
elementType: O O O N N N N C C C C C C C C C C C C C C C H H H H H H H H H H H H H H H H H H
charge: -0.291116 -0.445974 -0.222062 -0.376660 -0.543978 -0.403050 -0.157041 -0.143933 -0.269661 -0.621780 -0.527411 0.234637 0.545379 0.426343 0.189434 -0.371013 -0.443074 -0.461613 -0.235570 -0.225054 -0.225782 -0.242206 0.295010 0.229156 0.238052 0.235136 0.259577 0.222193 0.318546 0.278635 0.285847 0.231067 0.230983 0.337292 0.267447 0.227900 0.226370 0.284580 0.230121 0.413272
chargesum: 0.00000
title: Mulliken charges with hydrogens summed into heavy atoms:
elementType: O O O N N N N C C C C C C C C C C C C C C C
charge: -0.291116 -0.032701 -0.222062 -0.058114 0.020503 -0.065757 -0.157041 0.151077 -0.040505 -0.148592 -0.045641 0.234637 0.545379 0.426343 0.189434 -0.139946 -0.212091 -0.194166 -0.007670 0.001316 0.058798 -0.012086
polarizability: 1.96217926e+02 -3.17434514e+01 1.81468353e+02 -1.77426220e+00 -3.90272080e+00 1.75643576e+02
1716.lowfreq: -10.7231 -5.9175 0.0001 0.0002 0.0003 3.2581 17.8782 23.4753 29.6484
frequency: 17.0309 23.2329 29.6118 45.5520 62.1823 73.7448 81.1398 91.5022 105.5647 120.7451 136.8427 157.3569 182.2834 227.4876 238.2469 271.5398 285.0040 303.8815 324.5877 342.0923 360.3281 394.0635 403.5536 419.4497 483.1493 525.8075 547.7068 591.1290 602.1153 617.4188 636.6091 646.6936 653.4779 664.7644 686.8795 693.7389 699.4934 705.1194 738.3605 750.3156 755.6780 783.2648 804.4233 825.0797 845.6376 853.5173 869.2471 886.4831 902.7398 921.6384 927.9927 976.4585 984.8881 990.4349 996.3198 1004.1383 1022.5084 1028.8850 1081.3773 1087.4520 1089.9060 1099.1840 1113.2839 1121.8141 1126.1918 1172.6646 1181.0882 1189.8643 1208.6949 1215.7543 1226.1562 1230.0538 1244.5361 1272.5219 1289.1380 1302.8105 1313.0192 1318.9460 1320.3382 1344.0274 1351.2111 1364.3800 1377.9106 1384.1288 1436.4817 1441.3002 1452.9896 1466.8172 1484.9388 1490.3300 1564.8583 1594.8613 1606.9060 1615.7929 1649.0723 1650.2170 2991.2427 3003.0892 3011.9982 3047.4505 3077.9009 3085.3989 3115.6400 3118.3200 3133.0586 3145.6400 3163.5756 3228.5596 3255.6864 3283.7909 3427.0253 3533.7846 3551.3398 3566.6107
redmass: 5.7532 3.8647 5.6600 5.4420 6.1990 4.0074 6.2849 7.1814 5.7438 5.6527 5.0719 5.4343 4.9596 3.1535 3.1737 3.8334 2.1601 3.0307 2.1320 2.1284 4.7456 4.3903 2.8173 4.0752 3.5387 3.5742 4.1930 1.4336 1.3937 6.2223 3.7102 3.6017 2.7252 2.9092 1.3191 2.2839 4.1189 1.8448 2.3504 3.7791 1.8559 1.4842 4.8260 1.5457 3.6560 1.2734 1.9465 3.5137 5.5928 1.7293 1.6783 1.3899 3.7631 6.1999 1.3213 3.4842 2.5109 2.1559 4.2101 2.7331 1.6956 1.3995 2.4759 2.0107 1.7684 1.0643 1.3111 1.1362 1.5181 2.4240 1.9358 2.0709 1.5488 1.2529 1.4754 1.4194 1.4386 1.4154 1.7642 1.3073 2.4180 1.3950 2.8820 7.0226 2.9213 2.1201 1.1147 1.1943 2.2879 1.6572 4.5198 6.0383 5.8352 6.1582 1.1087 8.3494 1.0604 1.0770 1.0720 1.1000 1.0870 1.0999 1.0872 1.0871 1.0907 1.0958 1.1015 1.0983 1.0994 1.0667 1.0454 1.0767 1.0960 1.0824
irintensity: 2.5083 0.3343 0.6232 19.0504 8.6685 2.3179 3.1985 2.3569 9.3631 3.2535 3.4670 1.8067 7.1238 17.7441 15.0462 13.5571 37.2088 24.3491 1.1239 2.2442 1.4761 1.9543 0.0493 2.5919 2.2119 28.2764 35.9313 71.0388 357.2514 2.8049 35.1896 4.7898 35.6541 28.3623 184.4383 128.0027 13.0175 48.5846 96.5397 11.8707 92.9978 32.1438 11.6032 31.5744 4.1770 0.3214 7.6413 45.9720 17.2338 3.1525 5.2002 0.0837 3.5901 0.1791 0.0961 5.0417 1.9143 10.0671 11.5924 14.2838 35.6815 13.8131 167.7457 15.8979 0.7896 0.0601 3.8732 2.8272 8.4027 0.3822 40.4284 19.5017 7.3341 2.2930 4.0193 5.2075 15.6554 6.4013 22.2138 1.7835 3.6686 6.3048 14.5701 0.3094 9.4325 7.9636 12.3357 67.5140 30.5839 106.3292 14.5320 0.8636 105.4699 9.9235 35.6586 216.0854 18.7231 6.3141 33.7372 7.6794 5.4716 9.6200 7.7082 6.6874 10.7258 37.7042 21.7014 4.1750 3.9834 302.6338 1.7480 19.7463 2.9866 52.9183
temp: 298.150 k
press: 1.00000 atm
elementType: 8 8 8 7 7 7 7 6 6 6 6 6 6 6 6 6 6 6 6 6 6 6 1 1 1 1 1 1 1 1 1 1 1 1 1 1 1 1 1 1
symmnumber: 1
zpe: 834636.1 jmol-1
zpe.correction: 0.317896 hartree
zpe.thermalcorrener: 0.338771 hartree
zpe.thermalcorrenthalpy: 0.339716 hartree
zpe.thermalcorrgfe: 0.265389 hartree
zpe.sumelectzpe: -1025.475607 hartree
zpe.sumelectthermal: -1025.454732 hartree
zpe.sumelectthermalent: -1025.453788 hartree
zpe.sumelectthermalfe: -1025.528114 hartree
dipole: -2.2665 2.4467 -1.1498
dipole: 3.5278
quadrupole: -130.2116 -137.0507 -123.3512
quadrupole: 2.1087 6.0707 -0.3395
quadrupole: -0.0071 -6.8462 6.8533 2.1087 6.0707 -0.3395
hfenergy: -1025.7935036 hartree
pointgroup: C01 [X(C15H18N4O3)]
dipole: 0.8107236 -0.9806113 -0.5545132 debye
polarizability: 190.3162369|-32.680486|186.4059248|-1.42158|4.3109768|176.6076935 unknown
InChI: InChI=1S/C15H18N4O3/c16-12(7-11-8-17-9-18-11)14(20)19-13(15(21)22)6-10-4-2-1-3-5-10/h1-5,8-9,12-13,18-19,21H,6-7,16H2
charge 0 multiplicity 1
40 atoms
O  -0.547091 -1.422747 1.522875
O  -1.067932 2.319385 -0.872423
O  -1.011369 2.745281 1.424026
N  0.035006 -0.108216 -0.324155
N  -0.829124 -3.597313 -0.51677
N  -3.37569 -0.033288 0.894344
N  -3.815986 1.560653 -0.636559
C  0.518819 1.059334 0.431148
C  -1.243091 -2.198629 -0.707032
C  1.853404 1.618326 -0.14274
C  -2.793559 -2.090806 -0.484351
C  -0.540138 -1.215414 0.265917
C  2.990576 0.607619 -0.089203
C  -3.279396 -0.672332 -0.355852
C  -0.581524 2.139042 0.420001
C  3.483097 0.137528 1.155839
C  3.582121 0.118261 -1.280336
C  -3.570581 0.331858 -1.28517
C  4.538057 -0.798854 1.20829
C  4.639806 -0.819423 -1.233122
C  -3.702066 1.294809 0.6856
C  5.120515 -1.282159 0.012656
H  0.649157 0.739619 1.478251
H  -1.021105 -1.911853 -1.752926
H  2.109644 2.520663 0.446316
H  1.680694 1.953482 -1.182618
H  -3.285924 -2.607019 -1.324945
H  -3.03535 -2.660279 0.433377
H  -0.11465 0.04091 -1.325297
H  0.107838 -3.799889 -0.88425
H  -0.903899 -3.879861 0.469543
H  3.042433 0.506804 2.090509
H  3.218295 0.478767 -2.250791
H  -3.126494 -0.465121 1.785878
H  -3.608977 0.255403 -2.36948
H  4.90715 -1.150063 2.178395
H  5.08848 -1.183782 -2.164271
H  -3.80393 2.022048 1.486115
H  5.94132 -2.006884 0.052942
H  -2.018035 2.655542 -0.885332
