program: Gaussian 09
title: 000152196
version: EM64L-G09RevD.01
frameworkgroup: C1[X(C12H20O2)]
method: RPBEPBE
basis: SDD
operation: Freq
keyword: #pfreq=noraman
keyword: PBEPBE/SDD
title: #p freq=noraman PBEPBE/SDD
converged: NO YES NO NO
title: Mulliken charges:
elementType: O O C C C C C C C C C C C C H H H H H H H H H H H H H H H H H H H H
charge: -0.417826 -0.231533 -0.383539 -0.383944 -0.373310 -0.368694 -0.372736 -0.375852 -0.378504 -0.487984 -0.507741 0.170976 0.222153 -0.524002 0.195361 0.192340 0.195432 0.196680 0.188554 0.195045 0.191181 0.192064 0.220692 0.186460 0.217982 0.217712 0.209985 0.201106 0.252506 0.252055 0.232217 0.225557 0.375156 0.274452
chargesum: 0.00000
title: Mulliken charges with hydrogens summed into heavy atoms:
elementType: O O C C C C C C C C C C C C
charge: -0.042670 -0.231533 0.004161 0.008168 0.010289 0.014551 0.034416 0.059842 0.032587 0.016576 -0.049968 0.170976 0.222153 -0.249550
polarizability: 1.65065578e+02 -5.76729861e+00 1.29303664e+02 2.22413551e+00 -2.25847059e+00 1.03155999e+02
1716.lowfreq: -1.1003 -0.0004 0.0007 0.0009 5.8808 13.0756 14.8439 23.3296 35.5176
frequency: 14.8123 22.7437 35.3036 48.0080 53.4670 77.6990 96.7410 106.1291 122.5630 143.4896 153.0272 177.4918 187.0552 205.7548 296.7063 325.5111 338.8530 410.2731 449.6939 497.9618 501.1631 549.7894 589.1483 632.6648 638.2388 639.0411 722.8629 726.7823 742.4327 777.1784 826.6907 842.4895 857.2780 878.8076 938.0930 984.4966 1002.9753 1004.4770 1019.9023 1042.1797 1066.5334 1073.9756 1081.5307 1084.9334 1103.4781 1112.1163 1119.9673 1189.4972 1201.4183 1220.8973 1236.2713 1244.4797 1264.6623 1272.3908 1282.4559 1288.1488 1295.7555 1299.0752 1300.5782 1317.6676 1329.3251 1351.9958 1358.5536 1362.9135 1373.4104 1437.3460 1456.1120 1460.3750 1461.6068 1464.4525 1465.9453 1473.8197 1482.2522 1487.9528 1668.1428 2136.6162 2950.4661 2952.1140 2953.8939 2960.8239 2965.3539 2971.4645 2979.5826 2985.4434 2985.9761 2992.5548 2995.7384 3005.9332 3018.2917 3024.3891 3029.6574 3036.9143 3051.3115 3062.0335 3427.7453 3511.3269
redmass: 8.0110 4.8657 4.3460 2.0304 3.4808 3.1668 1.9115 3.1923 2.6185 2.0346 2.0592 4.8529 2.7004 3.7844 3.8142 3.6258 3.1315 3.6904 3.6669 3.1857 1.8373 3.1436 4.6312 1.2313 1.3165 1.2199 1.0651 1.0971 1.1871 1.3511 1.5498 2.2947 4.6869 1.5777 1.4099 4.1614 4.6618 1.2648 2.7874 3.1975 2.6242 2.6675 2.0676 2.1812 3.1790 1.6183 1.3627 1.2617 1.5051 1.3123 1.3728 1.3869 1.3311 1.2825 1.0372 1.1411 1.1507 1.1587 1.2265 1.3103 1.4354 1.5050 1.7000 1.5736 1.8281 1.0851 1.0885 1.0783 1.0696 1.0687 1.0786 1.0956 1.0994 1.1006 8.1891 6.0491 1.0587 1.0589 1.0596 1.0605 1.0595 1.0591 1.0621 1.0930 1.0639 1.0982 1.0596 1.1002 1.1011 1.1003 1.0999 1.1040 1.1043 1.1032 1.1580 1.0639
irintensity: 1.2754 0.0950 0.3106 0.2104 0.0150 0.0515 0.1649 0.5041 0.3436 0.0105 0.0217 1.3378 0.1600 1.7306 0.3089 9.7701 3.9468 5.2908 0.7674 24.2500 28.8797 3.3656 14.1916 78.1695 122.0831 86.4463 19.4438 0.0044 6.8231 0.7074 1.7971 2.1317 1.6901 1.9487 0.1815 21.0930 29.7637 2.6844 97.0988 89.1634 33.3230 6.7235 2.0904 1.2122 21.6449 0.5600 0.9951 18.0796 4.8638 11.2717 0.0858 1.9964 4.3461 2.7579 0.3492 0.7053 3.5794 2.6297 11.1707 7.4512 13.4925 9.7455 0.3708 5.1786 29.8555 28.0816 12.5411 1.2117 0.3064 0.2499 0.1224 4.3706 0.2673 29.7057 208.7363 9.4673 4.8581 1.6289 0.2854 7.8779 109.7147 35.2949 60.5686 2.8093 4.9550 4.5499 40.2090 0.6552 6.3110 21.7489 4.9149 38.5311 125.7832 94.5800 59.8530 17.7427
temp: 298.150 k
press: 1.00000 atm
elementType: 8 8 6 6 6 6 6 6 6 6 6 6 6 6 1 1 1 1 1 1 1 1 1 1 1 1 1 1 1 1 1 1 1 1
symmnumber: 1
zpe: 767809.0 jmol-1
zpe.correction: 0.292443 hartree
zpe.thermalcorrener: 0.309871 hartree
zpe.thermalcorrenthalpy: 0.310815 hartree
zpe.thermalcorrgfe: 0.243169 hartree
zpe.sumelectzpe: -618.551885 hartree
zpe.sumelectthermal: -618.534457 hartree
zpe.sumelectthermalent: -618.533513 hartree
zpe.sumelectthermalfe: -618.601159 hartree
dipole: -0.1715 0.4139 1.0844
dipole: 1.1733
quadrupole: -90.8488 -87.1885 -86.9205
quadrupole: 10.5705 2.4786 -5.2627
quadrupole: -2.5296 1.1307 1.3988 10.5705 2.4786 -5.2627
hfenergy: -618.8443279 hartree
pointgroup: C01 [X(C12H20O2)]
dipole: 0.0693058 0.1643302 -0.4257602 debye
polarizability: 165.2070212|5.3043274|129.1388578|2.2536102|2.3713482|103.179362 unknown
InChI: InChI=1S/C12H20O2/c1-2-3-4-5-6-7-8-9-10-11-12(13)14/h1,13H,3-11H2
charge 0 multiplicity 1
34 atoms
O  -6.803774 0.983661 -0.296075
O  -5.994534 -0.903234 0.785499
C  0.684724 0.027547 -0.362742
C  -0.679321 -0.523481 0.109254
C  1.881466 -0.84277 0.082399
C  -1.876521 0.345125 -0.337317
C  3.245659 -0.288577 -0.385679
C  -3.235371 -0.214163 0.137431
C  4.433622 -1.170116 0.055455
C  -4.415814 0.66548 -0.315121
C  5.817299 -0.622444 -0.40012
C  -5.764733 0.136301 0.129601
C  6.16063 0.684213 0.194625
C  6.450626 1.771605 0.701163
H  0.818973 1.058892 0.025297
H  0.683856 0.110269 -1.469902
H  -0.811916 -1.555624 -0.277111
H  -0.678536 -0.604754 1.216217
H  1.74806 -1.874114 -0.306972
H  1.881537 -0.926298 1.189335
H  -1.874956 0.426609 -1.444752
H  -1.742705 1.376875 0.050611
H  3.386262 0.736082 0.012457
H  3.246612 -0.198531 -1.492307
H  -3.374894 -1.242338 -0.248018
H  -3.242416 -0.299125 1.241017
H  4.43128 -1.271763 1.158238
H  4.313987 -2.190176 -0.362189
H  -4.314404 1.69929 0.070183
H  -4.439534 0.763562 -1.418662
H  6.608032 -1.352692 -0.137367
H  5.827019 -0.530468 -1.504962
H  -7.673995 0.608535 0.010537
H  6.70598 2.718121 1.140878
