program: Gaussian 09
title: 000152195
version: EM64L-G09RevD.01
frameworkgroup: C1[X(C6H12O6)]
method: RPBEPBE
basis: SDD
operation: Freq
keyword: #pfreq=noraman
keyword: PBEPBE/SDD
title: #p freq=noraman PBEPBE/SDD
converged: YES YES NO NO
title: Mulliken charges:
elementType: O O O O O O C C C C C C H H H H H H H H H H H H
charge: -0.487030 -0.461669 -0.452972 -0.458145 -0.396294 -0.282242 -0.162275 -0.062318 -0.182908 -0.508643 -0.334344 0.241932 0.244635 0.246139 0.277236 0.279430 0.241555 0.189786 0.219979 0.363237 0.377411 0.359061 0.368500 0.379941
chargesum: 0.00000
title: Mulliken charges with hydrogens summed into heavy atoms:
elementType: O O O O O O C C C C C C
charge: -0.123794 -0.084258 -0.093912 -0.089645 -0.016353 -0.282242 0.082360 0.183821 0.094327 0.012342 0.075422 0.241932
polarizability: 1.00047355e+02 8.97075011e-01 8.22836254e+01 2.28954662e+00 -2.76737653e+00 7.17712194e+01
1716.lowfreq: -8.0945 -0.0008 -0.0007 0.0005 4.0272 18.7850 40.3296 74.9491 91.8091
frequency: 39.9354 74.8822 91.7848 96.1799 141.7557 156.9058 208.4467 219.3564 250.5616 279.1133 299.9834 336.7807 372.4700 378.1618 452.6176 482.1454 503.4196 522.8645 564.8334 592.4080 665.2495 668.6814 708.9748 721.0124 787.6689 837.2734 880.2932 916.5857 955.5887 970.9555 1000.4227 1029.5401 1043.2572 1068.2894 1092.0329 1098.7579 1152.8495 1188.3584 1216.4803 1220.9774 1238.6775 1267.2289 1281.9661 1299.8507 1317.1094 1351.8021 1372.7267 1378.5465 1384.1351 1394.3184 1416.0425 1429.9184 1486.5121 1641.9018 2974.2563 2984.5249 3007.6593 3047.5285 3053.3472 3089.2939 3099.9615 3376.4347 3430.7417 3499.8771 3504.5633 3582.6360
redmass: 6.2250 6.2734 5.1884 7.0523 4.3911 8.2306 3.0725 5.7593 5.9165 3.9450 1.5149 2.4039 3.0919 3.3921 2.6958 1.4538 2.2859 3.7821 2.7097 1.1525 2.6576 1.6910 4.6662 1.1383 3.5889 3.5353 2.8577 3.3701 3.6697 5.2270 2.7988 2.5560 2.3760 2.5423 2.3575 1.9732 1.1318 1.1132 1.1953 1.2546 1.2409 1.4852 1.4832 1.2726 1.2285 1.3547 1.5669 1.3535 1.3127 1.2400 1.4677 1.1122 1.0899 7.8562 1.0833 1.0613 1.0671 1.1015 1.0863 1.0869 1.0948 1.0667 1.0638 1.0662 1.0641 1.0667
irintensity: 0.7278 4.5214 3.5609 19.3284 4.4176 0.9884 5.3071 4.1574 20.3412 33.2168 34.1303 27.0052 1.1384 12.3391 47.4173 179.4658 25.1074 67.3192 23.6316 72.3383 49.8769 111.4324 0.3414 326.2192 8.7624 5.7833 33.0991 46.8777 15.7313 51.0670 41.5938 46.4206 161.1003 54.5584 39.2810 110.0189 19.0233 57.6410 40.7172 11.3335 54.6572 21.7080 8.4316 5.2762 10.0740 2.8103 67.9455 19.9177 1.9786 84.5225 14.9303 26.7984 4.6230 271.7265 30.9340 65.5224 9.9896 27.0397 13.8663 19.0511 3.2193 112.2151 34.4518 93.5232 13.7906 14.5173
temp: 298.150 k
press: 1.00000 atm
elementType: 8 8 8 8 8 8 6 6 6 6 6 6 1 1 1 1 1 1 1 1 1 1 1 1
symmnumber: 1
zpe: 497643.0 jmol-1
zpe.correction: 0.189542 hartree
zpe.thermalcorrener: 0.202728 hartree
zpe.thermalcorrenthalpy: 0.203673 hartree
zpe.thermalcorrgfe: 0.149933 hartree
zpe.sumelectzpe: -686.176183 hartree
zpe.sumelectthermal: -686.162996 hartree
zpe.sumelectthermalent: -686.162052 hartree
zpe.sumelectthermalfe: -686.215792 hartree
dipole: -0.9614 0.3172 2.0869
dipole: 2.3195
quadrupole: -64.2982 -79.7006 -70.9994
quadrupole: -8.3462 2.0264 -7.0948
quadrupole: 7.3679 -8.0345 0.6666 -8.3462 2.0264 -7.0948
hfenergy: -686.3657248 hartree
pointgroup: C01 [X(C6H12O6)]
dipole: 0.4513898 -0.427369 0.668089 debye
dipolederiv: -0.6124282 0.1410937 0.0500285 0.1596627 -0.2391232 -0.167468 0.0827397 -0.1357415 -0.7939709 -0.5339922 -0.0365488 -0.0950165 -0.0305723 -0.6996589 0.133451 -0.1410376 0.1238514 -0.6084715 -0.7282263 0.0607979 -0.1524289 -0.0118934 -0.7709769 -0.0009877 -0.1302843 0.0427834 -0.3128442 -0.5544753 0.0623969 -0.1754579 0.0544015 -0.7848761 -0.0611106 -0.1908333 -0.1228564 -0.4025132 -1.2031798 0.1351476 0.3536916 0.1924321 -0.3169052 0.02129 0.4964983 0.0167277 -0.5303364 -1.0971459 -0.1056278 0.1202127 -0.3838661 -0.6322992 -0.1380681 -0.0922998 -0.2308522 -0.457254 0.2966788 -0.1109595 -0.1825687 -0.1373389 0.0150689 0.0714485 -0.2507565 0.1427826 0.4277137 0.3643586 -0.1047677 0.0918498 -0.1040572 0.4336058 -0.1314334 0.0600772 -0.1501347 0.4775223 0.2377774 -0.0965822 0.014982 0.0189707 0.47398 0.0334979 0.0454344 0.0189056 0.1136295 -0.0791158 0.0408561 -0.0036396 0.0397392 -0.0799248 -0.1293381 0.0590192 -0.1929799 -0.0975381 0.3974614 -0.1423883 0.0700961 -0.1643068 0.4059515 0.0063122 0.0423 0.0384332 0.3201851 1.6893688 0.0691219 -0.4181347 0.2461207 0.7117416 0.355079 -0.373057 0.4366558 0.746384 0.0366565 0.0639223 0.0205158 0.0984735 -0.0335236 0.0575376 0.0075639 0.0629668 0.0160991 0.0164525 0.0123087 -0.0145167 -0.0152002 -0.0276559 -0.0893723 -0.0386251 -0.0463791 -0.1262676 0.055998 0.0249874 0.0569708 0.0032108 0.0477073 -0.0037929 0.1018651 -0.0351266 -0.0209141 -0.019659 -0.0589217 0.02003 -0.059087 0.0506923 -0.0171178 0.0565923 0.0064464 0.1069784 0.1233253 0.0157143 0.0125939 0.0422403 0.0213302 0.054622 -0.0325903 0.0589018 -0.0294019 -0.047015 0.0339757 0.0821451 0.0594717 0.0241918 -0.0233637 0.1681606 -0.0176038 -0.0529404 -0.0319394 0.005978 -0.0973829 -0.0010276 0.006279 -0.0019058 -0.163894 0.0059426 -0.122189 0.234879 -0.0688552 0.0780822 -0.0942597 0.120998 0.0824862 0.041162 0.0560265 0.3532204 0.3765108 0.1379087 0.0318529 0.1235904 0.388752 -0.0128015 0.0369398 -0.0152025 0.2772046 0.357646 -0.0276491 0.0982326 -0.0375879 0.3009739 0.0098018 0.1208365 -0.0470472 0.2082548 0.3744973 0.0380501 0.0968701 0.0732478 0.3670942 0.0826572 0.1267438 0.1118519 0.2239047 0.3455664 -0.0899589 -0.0590084 -0.0723644 0.2165771 -0.1314236 -0.032555 -0.1283519 0.2835445 unknown
polarizability: 98.9320617|0.0021829|79.4189139|-5.5158341|5.6821185|75.7512246 unknown
InChI: InChI=1S/C6H12O6/c7-2-4(9)6(12)3(8)1-5(10)11/h3-4,6-10,12H,1-2H2
charge 0 multiplicity 1
24 atoms
O  -1.526057 1.064788 1.941043
O  0.537629 2.026457 -0.555959
O  -2.23596 1.598509 -0.584549
O  -1.927936 -2.138951 -0.029459
O  3.120217 -0.76122 -1.08128
O  0.929534 -1.42687 -0.800052
C  -0.717327 0.373614 0.893421
C  0.563492 1.231494 0.677009
C  -1.582018 0.286562 -0.387186
C  1.864393 0.407786 0.60395
C  -2.599596 -0.870883 -0.34658
C  1.872696 -0.662797 -0.473445
H  -0.461962 -0.644323 1.234796
H  0.635304 1.902205 1.558642
H  -0.923437 0.162706 -1.260691
H  2.708745 1.09093 0.42089
H  2.041048 -0.091166 1.577507
H  -3.353209 -0.724511 0.44925
H  -3.129113 -0.921844 -1.318823
H  -2.037446 0.391343 2.455186
H  -0.400093 2.339192 -0.714995
H  -2.548916 1.872601 0.324909
H  -1.065238 -2.180281 -0.523968
H  3.105254 -1.48594 -1.765316
