program: Gaussian 09
title: 000152192
version: EM64L-G09RevD.01
frameworkgroup: C1[X(C10H20O7P2)]
method: RPBEPBE
basis: SDD
operation: Freq
keyword: #p
keyword: freq=noraman
keyword: PBEPBE/SDD
title: #p freq=noraman PBEPBE/SDD
converged: YES YES NO NO
title: Mulliken charges:
elementType: P P O O O O O O O C C C C C C C C C C H H H H H H H H H H H H H H H H H H H H
charge: 1.455276 1.406275 -0.533575 -0.748221 -0.642673 -0.661751 -0.658941 -0.682009 -0.574388 0.332156 -0.438422 -0.466952 -0.785883 -0.164122 -0.322356 0.375704 -0.527567 -0.783733 -0.794607 0.225504 0.240598 0.209907 0.243553 0.222223 0.262686 0.252871 0.272014 0.215414 0.241708 0.230404 0.227401 0.216851 0.217373 0.220969 0.238710 0.218891 0.411316 0.404557 0.442834
chargesum: 0.00000
title: Mulliken charges with hydrogens summed into heavy atoms:
elementType: P P O O O O O O O C C C C C C C C C C
charge: 1.455276 1.406275 -0.533575 -0.748221 -0.231357 -0.661751 -0.254384 -0.239175 -0.574388 0.332156 0.027681 -0.013491 -0.048102 0.107893 -0.106942 0.375704 -0.055455 -0.122108 -0.116037
polarizability: 2.20773208e+02 1.07101494e+01 1.81428477e+02 -4.62261935e+00 2.24781506e-01 1.48975884e+02
1716.lowfreq: -3.2063 0.0002 0.0014 0.0015 6.5145 13.0233 18.4093 23.3311 34.0897
frequency: 18.1468 22.6213 33.8631 51.1900 58.9981 61.7906 72.7735 86.6397 91.0647 116.5008 127.8566 142.0300 164.3738 178.2604 189.5825 192.7606 208.2917 218.3604 240.0244 261.6752 266.3120 275.3141 286.0878 295.2241 301.1779 311.8629 322.2209 341.9054 348.0607 368.4510 372.9659 389.3759 417.8842 433.1711 457.5799 471.1021 512.6912 537.5498 561.8634 624.3752 685.7703 697.5793 724.9960 740.6267 750.0613 777.1125 796.2193 805.3593 815.1379 825.1943 850.1350 933.6196 948.1560 956.7299 973.2155 984.1701 993.5196 1006.1824 1014.9871 1027.4361 1031.4963 1048.6146 1051.2607 1081.0913 1082.8943 1099.5629 1127.0106 1165.0482 1187.0780 1224.2600 1245.9553 1281.7521 1287.5085 1317.1906 1333.7634 1351.3522 1360.3462 1388.4197 1392.9472 1399.6490 1423.9777 1444.4676 1455.5627 1460.9063 1467.5003 1472.4423 1473.2898 1484.0916 1494.1935 1649.8237 1695.3912 2742.2882 2957.6482 2965.3306 2981.5822 2987.0549 2999.0333 3029.4133 3033.5508 3047.8681 3061.5156 3077.4453 3082.0027 3095.5609 3096.3180 3104.5113 3109.6182 3114.8375 3217.8376 3581.2163 3588.4674
redmass: 3.9938 3.2888 5.3014 6.9875 5.7881 6.8206 4.2287 3.3321 2.6538 1.0848 2.4208 3.6219 2.3831 4.3278 1.5767 3.1550 5.9539 3.8152 1.3440 2.1948 2.0278 2.2356 2.5163 2.6137 3.1536 3.4429 2.7330 4.1348 6.7875 6.4548 4.0852 2.5761 3.6859 6.1816 2.7857 2.4089 3.1477 9.1040 3.1341 3.9841 4.8113 2.6982 8.4674 1.6097 13.5175 2.0797 2.2518 4.5241 2.0956 2.3124 1.5476 1.7994 1.3990 1.6514 5.3090 1.4705 1.2464 1.8148 1.1832 1.6076 2.9808 1.3213 1.5614 1.5958 1.6545 3.1731 2.3343 1.4428 2.0992 2.5501 2.1208 1.3038 1.2866 1.4361 1.1284 1.3801 1.4291 1.2914 1.2339 1.2413 1.1818 1.0826 1.0504 1.0656 1.0656 1.0496 1.0703 1.0849 1.0541 4.5542 6.4095 1.0744 1.0372 1.0388 1.0640 1.0625 1.0374 1.0970 1.0963 1.0948 1.0919 1.0989 1.0958 1.0986 1.0959 1.0696 1.0986 1.0846 1.1147 1.0660 1.0665
irintensity: 0.1578 0.1990 0.4273 0.9834 0.7007 1.2559 1.9276 0.0149 0.5519 0.1353 39.2113 12.2264 6.9753 0.5021 9.8604 34.3979 4.7051 4.0044 3.0712 13.0999 45.5892 8.0856 61.4851 4.6589 23.2570 15.4383 0.9614 11.1907 14.7667 124.8470 75.6328 12.6149 5.6990 14.8288 12.2463 1.4375 2.8530 69.8007 0.2752 23.8564 131.8699 85.1775 158.9902 17.0343 232.4916 41.7823 1.6207 126.5777 87.9121 601.7648 23.6092 1.8757 0.3250 9.2106 213.1322 113.0492 5.0072 12.2959 16.6075 11.4074 0.7872 66.9617 0.7115 7.0596 7.1943 169.5496 18.7840 19.3221 21.8139 1.9278 17.4521 4.2553 12.1569 4.5970 197.2167 8.6410 2.2033 23.2703 32.8917 11.9330 34.2594 4.2755 2.2630 1.6751 3.3767 25.2059 12.7151 17.3035 10.5701 1.4040 5.0311 771.8454 40.6250 51.3616 13.4759 24.9527 10.2006 5.9812 47.1115 8.7594 10.2224 1.6650 67.8955 8.2397 39.6188 6.9111 11.8055 0.9905 7.1131 81.2214 94.9310
temp: 298.150 k
press: 1.00000 atm
elementType: 15 15 8 8 8 8 8 8 8 6 6 6 6 6 6 6 6 6 6 1 1 1 1 1 1 1 1 1 1 1 1 1 1 1 1 1 1 1 1
symmnumber: 1
zpe: 781102.5 jmol-1
zpe.correction: 0.297506 hartree
zpe.thermalcorrener: 0.322506 hartree
zpe.thermalcorrenthalpy: 0.323450 hartree
zpe.thermalcorrgfe: 0.241227 hartree
zpe.sumelectzpe: -1600.519770 hartree
zpe.sumelectthermal: -1600.494770 hartree
zpe.sumelectthermalent: -1600.493826 hartree
zpe.sumelectthermalfe: -1600.576050 hartree
dipole: -4.2197 1.1310 -1.4741
dipole: 4.6106
quadrupole: -147.8619 -124.4924 -124.6284
quadrupole: 1.8202 -0.2496 -2.2830
quadrupole: -15.5343 7.8352 7.6992 1.8202 -0.2496 -2.2830
hfenergy: -1600.8172764 hartree
pointgroup: C01 [X(C10H20O7P2)]
dipole: -1.6636094 0.5065576 -0.5159686 debye
polarizability: 220.6927353|11.2844621|180.9744128|-3.6611061|3.9557263|149.510421 unknown
InChI: InChI=1S/C10H20O7P2/c1-5-10(4,8-6-7-9(2)3)16-19(14,15)17-18(11,12)13/h5,7,11-12,14H,1,6,8H2,2-4H3
charge 0 multiplicity 1
39 atoms
P  1.501921 -0.788101 1.10351
P  3.917116 -0.616092 -0.923512
O  -0.064648 -0.299984 0.719786
O  2.370392 -1.270644 -0.321102
O  1.100239 -2.292452 1.781237
O  2.434625 0.199175 1.963406
O  3.402065 0.305572 -2.279431
O  4.314835 0.569107 0.195234
O  4.933335 -1.774299 -1.266123
C  -0.367374 1.20293 0.381286
C  -1.751908 1.081574 -0.299158
C  -2.886501 0.498843 0.586785
C  -0.381213 1.975637 1.705456
C  0.678617 1.641858 -0.626498
C  -4.187261 0.398529 -0.18484
C  -4.845644 -0.732273 -0.573565
C  1.560388 2.660951 -0.474644
C  -6.151985 -0.642705 -1.34794
C  -4.375276 -2.14767 -0.287979
H  -2.029611 2.09645 -0.648301
H  -1.641009 0.451488 -1.201068
H  -3.041957 1.160203 1.462538
H  -2.565344 -0.481326 0.977343
H  -0.763002 2.998789 1.536612
H  0.626598 2.038327 2.148367
H  -1.043429 1.476769 2.430801
H  0.692704 1.054399 -1.555661
H  -4.63468 1.36631 -0.464638
H  2.286934 2.884578 -1.261972
H  1.596594 3.281076 0.427898
H  -6.455811 0.403909 -1.523833
H  -6.066892 -1.147274 -2.331227
H  -6.97189 -1.151503 -0.802644
H  -5.118353 -2.687294 0.332522
H  -3.404811 -2.188265 0.231784
H  -4.278362 -2.72074 -1.231452
H  1.809885 -2.981233 1.707462
H  3.640511 -0.115086 -3.14616
H  3.710002 0.590967 1.040122
