program: Gaussian 09
title: 000152190
version: EM64L-G09RevD.01
frameworkgroup: C1[X(C10H9N3O2S)]
method: RPBEPBE
basis: SDD
operation: Freq
keyword: #p
keyword: freq=noraman
keyword: PBEPBE/SDD
title: #p freq=noraman PBEPBE/SDD
converged: YES YES NO NO
title: Mulliken charges:
elementType: S O O N N N C C C C C C C C C C H H H H H H H H H
charge: 0.992932 -0.536681 -0.485741 -0.613475 -0.055159 -0.065110 -0.026580 -0.259534 -0.187285 0.135831 -0.203932 -0.222785 -0.214332 -0.258700 -0.247161 -0.168596 0.368665 0.292249 0.293322 0.243674 0.241952 0.238111 0.252196 0.246761 0.239375
chargesum: 0.00000
title: Mulliken charges with hydrogens summed into heavy atoms:
elementType: S O O N N N C C C C C C C C C C
charge: 0.992932 -0.536681 -0.485741 -0.244809 -0.055159 -0.065110 -0.026580 0.032715 0.106038 0.135831 0.039742 0.019167 0.023780 -0.006504 -0.000400 0.070779
polarizability: 2.00253044e+02 4.11909030e+00 1.58817863e+02 -9.89098117e+00 -2.01481042e+01 1.13025295e+02
1716.lowfreq: -5.5697 -0.0018 -0.0015 -0.0011 5.6901 13.6490 23.7065 42.8875 63.4277
frequency: 23.6787 42.8286 63.3668 80.9969 111.7143 146.4425 173.9174 211.0578 226.8442 247.2902 251.8462 346.4550 385.7049 401.1045 403.0550 438.6704 499.0156 512.6956 535.7750 601.7337 614.6138 617.6410 653.0667 685.3345 713.5881 761.8560 789.6888 805.4843 815.6984 842.7841 863.4957 932.0015 947.1374 956.6664 958.5365 975.2267 976.3662 980.8901 1003.7766 1007.5047 1048.2147 1055.6241 1075.5438 1081.2236 1173.7407 1178.8694 1179.9638 1264.4957 1303.7719 1307.9284 1360.3168 1384.1453 1406.6485 1438.6350 1440.6301 1453.2273 1520.2314 1550.5502 1575.8477 1605.4932 3138.8905 3140.8496 3143.7910 3151.9922 3161.9806 3173.4132 3185.4401 3190.8454 3507.4417
redmass: 4.9870 4.9719 4.9624 7.6496 6.4515 7.3326 6.6591 7.1793 7.8475 8.5922 10.0875 7.4555 8.6550 4.1907 2.8083 10.9776 3.9969 2.2979 1.7350 6.4762 7.7766 5.2042 6.4173 2.2800 3.0939 1.4584 2.6776 1.8184 14.3940 1.2502 5.7936 1.3679 7.9719 13.1641 1.3838 3.9045 1.4471 1.6200 1.3378 4.3905 2.1056 2.5700 1.6538 1.5976 1.0568 1.6030 1.1237 4.1609 1.4692 1.2930 1.8349 8.0414 1.7308 2.8434 3.7589 2.0109 5.6745 5.0195 5.7806 7.0166 1.0861 1.0907 1.0927 1.0893 1.0941 1.0988 1.0973 1.0990 1.0774
irintensity: 0.8630 0.3996 0.7167 0.9645 0.2249 1.2704 6.1061 8.9516 2.8245 6.2761 2.6279 5.5297 42.5981 5.8053 0.2117 136.8499 81.2202 22.6869 45.2817 0.1374 28.7606 19.7205 1.7417 32.2245 184.3134 68.3480 4.6826 47.9512 110.5712 1.0686 27.9780 2.8542 27.1677 62.8369 0.4566 0.6021 0.5920 0.7425 0.0589 0.8182 22.3032 0.1832 9.8375 0.9717 0.1640 5.5526 9.2089 9.3287 1.0136 3.9684 3.9804 8.8913 2.6887 171.5790 493.2877 14.5428 60.9533 237.2723 1.4681 0.4919 1.8214 15.0898 19.8236 12.9234 3.6506 14.5465 11.8380 14.8325 85.1807
temp: 298.150 k
press: 1.00000 atm
elementType: 16 8 8 7 7 7 6 6 6 6 6 6 6 6 6 6 1 1 1 1 1 1 1 1 1
symmnumber: 1
zpe: 465379.0 jmol-1
zpe.correction: 0.177254 hartree
zpe.thermalcorrener: 0.191531 hartree
zpe.thermalcorrenthalpy: 0.192475 hartree
zpe.thermalcorrgfe: 0.134347 hartree
zpe.sumelectzpe: -1097.900762 hartree
zpe.sumelectthermal: -1097.886485 hartree
zpe.sumelectthermalent: -1097.885541 hartree
zpe.sumelectthermalfe: -1097.943669 hartree
dipole: -0.3554 -5.9248 -1.9857
dipole: 6.2588
quadrupole: -78.6148 -100.6809 -104.4514
quadrupole: -1.7986 -4.8652 -7.3780
quadrupole: 15.9675 -6.0986 -9.8690 -1.7986 -4.8652 -7.3780
hfenergy: -1098.0780155 hartree
pointgroup: C01 [X(C10H9N3O2S1)]
dipole: -0.242312 -2.445491 0.1560221 debye
dipolederiv: 2.519484 0.2156749 0.2467248 0.0016408 1.663348 0.0330355 0.6916087 0.2151768 1.2910426 -0.7668431 -0.0506204 -0.0429033 -0.0191155 -0.6670706 0.0576762 0.074266 0.1703605 -0.5400249 -0.6698867 0.07864 0.0285168 0.0383426 -0.6155982 -0.0436187 -0.2034837 -0.1765039 -0.5734818 -1.8620976 -0.5545021 0.0643016 -0.4791921 -0.7741671 -0.0625995 0.2495545 0.0722213 -0.4818989 -1.1792473 -0.4203034 0.0250666 -0.3200103 -0.4262498 0.0856091 -0.3442235 -0.0535995 -0.3288702 -0.6368714 -0.0966189 -0.0590608 -0.4639568 -0.4058064 0.0848924 0.5501032 0.3247511 -0.3324855 -0.0354923 -0.1208336 0.0127572 -0.1532005 -0.1136556 -0.0334527 0.0298225 -0.1100458 -0.0777442 -0.0959965 -0.0528528 0.0478033 0.1685412 -0.127695 -0.0810575 -0.1883128 0.1051295 -0.0827026 -0.1048332 0.113103 -0.1108068 0.0071151 -0.1198504 0.091503 0.0783345 -0.0730383 -0.0789134 1.7121125 0.6364195 -0.0665105 0.9943955 0.6574942 -0.0359545 -0.8140506 -0.3897182 0.146295 0.0090235 -0.0091763 -0.1575947 -0.0749377 -0.0954551 0.051365 -0.0787123 -0.0160546 -0.0334186 -0.1201333 -0.0271492 -0.0061096 0.0391992 -0.0245251 -0.1643459 -0.0714007 -0.0702344 0.0335573 0.007088 -0.1178296 -0.0257582 -0.1026518 0.0515229 -0.0650511 -0.0184422 -0.0709708 -0.0269798 0.4902889 0.227438 0.0008952 0.1855635 0.2100545 -0.231623 0.1765777 -0.1714205 0.383264 0.5176732 0.079035 0.190573 0.3189953 0.14234 -0.1178946 -0.0942687 -0.2205908 0.3247608 -0.3174019 0.0592984 -0.196139 -0.0197385 -0.1637312 0.0732053 -0.1432757 0.123545 -0.3960901 0.1003666 -0.0582316 -0.0905956 -0.1665198 0.2082427 -0.0084947 -0.080097 -0.0194907 0.2811215 0.1790072 0.0098951 0.0078992 -0.0338432 0.1061869 0.0654971 0.0163043 0.0382704 0.0887271 0.1235508 0.0146776 0.0721941 0.0028785 0.1203431 -0.0104443 0.0837671 0.0043381 0.1323378 -0.0139443 0.0684766 0.0991734 0.0791395 0.0869714 0.0117035 0.1048649 0.0079712 0.0491807 0.0884441 0.019211 0.0477815 0.0396387 0.0366537 0.109405 0.030553 0.1056064 -0.0031241 0.0323628 0.1149744 -0.0071679 0.1264139 -0.0044457 0.0517275 -0.0073074 0.0491772 0.1085694 -0.0656857 -0.0315642 -0.0840396 -0.0170786 0.1086208 0.0031578 -0.1042638 -0.0035945 0.0464124 0.1003873 0.0021553 -0.0267697 -0.0301785 0.0512368 0.0825989 0.031879 0.0989291 -0.0367352 -0.0113556 -0.0993165 0.0297691 -0.1214405 0.0952355 0.0531602 0.0302028 0.0597855 0.1072006 unknown
polarizability: 202.1027309|1.923736|137.5235189|-2.6250044|-30.1072949|132.4699519 unknown
InChI: InChI=1S/C10H9N3O2S/c14-16(15,9-5-2-1-3-6-9)13-10-11-7-4-8-12-10/h1-8,13H
charge 0 multiplicity 1
25 atoms
S  0.654388 1.608569 -0.16516
O  1.431707 2.564783 -1.225683
O  0.067291 2.19576 1.222264
N  -0.70852 0.963379 -1.24746
N  -2.896827 0.249046 -1.625022
N  -1.683288 -0.431083 0.397512
C  1.72895 0.096607 0.182785
C  2.797865 -0.132547 -0.697584
C  1.450196 -0.675102 1.320125
C  -1.801819 0.240783 -0.793188
C  3.642011 -1.231709 -0.415648
C  2.311048 -1.765847 1.582707
C  3.396636 -2.042829 0.717677
C  -3.955321 -0.504879 -1.218458
C  -2.774902 -1.152517 0.777354
C  -3.950603 -1.230447 -0.003688
H  -0.826146 1.538547 -2.091184
H  2.970453 0.532019 -1.550031
H  0.594231 -0.435809 1.956452
H  4.488497 -1.446241 -1.075848
H  2.131923 -2.395198 2.460367
H  4.057696 -2.889973 0.930438
H  -4.82407 -0.508792 -1.885823
H  -2.691066 -1.68092 1.733398
H  -4.813128 -1.818201 0.317498
