program: Gaussian 09
title: 000152187
version: EM64L-G09RevD.01
frameworkgroup: C1[X(C10H7O3)]
method: RPBEPBE
basis: SDD
operation: Freq
keyword: #p
keyword: freq=noraman
keyword: PBEPBE/SDD
title: #p freq=noraman PBEPBE/SDD
converged: NO NO NO NO
title: Mulliken charges:
elementType: O O O C C C C C C C C C C H H H H H H H
charge: -0.378380 -0.383638 -0.354347 0.288244 0.061118 0.307048 0.017043 -0.435845 -0.432511 -0.809495 -0.241325 -0.263157 0.041636 0.258822 0.214870 0.255768 0.187933 0.256134 0.206346 0.203736
chargesum: -1.00000
title: Mulliken charges with hydrogens summed into heavy atoms:
elementType: O O O C C C C C C C C C C
charge: -0.378380 -0.383638 -0.354347 0.288244 0.061118 0.307048 0.017043 -0.177024 -0.217641 -0.109659 -0.034979 -0.059422 0.041636
polarizability: 2.43304332e+02 5.96059955e+00 1.28704658e+02 -1.42458160e-02 -1.55462016e-02 5.29086173e+01
1716.lowfreq: -184.4075 -93.1443 -8.5075 -1.8441 -0.0008 -0.0007 -0.0007 7.6772 29.2309
frequency: -184.4072 -93.1317 28.9051 68.6584 87.0023 125.5876 154.1517 187.3329 241.4900 282.9214 310.4374 345.2765 455.0817 459.1575 512.6778 528.7352 542.5962 605.1736 693.5979 698.9683 710.1399 746.7507 778.9201 843.9883 857.2986 901.8305 922.2849 965.0423 990.9527 1026.0643 1037.1648 1109.0371 1156.9938 1162.2728 1197.2970 1235.4730 1276.5029 1369.4606 1399.2301 1424.2226 1456.0408 1467.2248 1471.2472 1539.1124 1549.9380 1599.8747 1879.9430 2979.2927 3053.7946 3082.6090 3101.9972 3115.3841 3138.1141 3156.4781
redmass: 13.2293 1.4616 9.8596 2.6689 6.9174 5.1190 7.5351 3.7935 5.3700 7.3782 3.8919 5.4456 3.0052 6.2483 6.8193 6.9924 3.8030 8.4291 11.5398 8.0535 2.5873 1.4082 5.8473 6.5237 1.3205 10.4499 1.3664 1.3053 1.6775 1.5807 2.0999 1.6999 13.7290 1.0663 2.5908 3.3997 1.5172 4.2143 1.3896 1.8747 1.0403 1.2213 2.8604 11.0922 5.9484 5.7682 11.9877 1.0371 1.0949 1.1009 1.0848 1.0890 1.0950 1.0979
irintensity: 33.0874 2.7232 0.4873 0.1498 6.9911 0.3246 2.7296 0.7748 11.6444 2.9095 7.2274 0.2540 5.2682 3.6161 1.9491 4.0969 0.1824 12.6486 4.3923 45.7449 14.8689 81.1004 16.1035 71.6469 3.0554 110.4678 3.6278 0.5585 2.1249 7.9902 33.3517 6.7915 303.9866 0.0874 1.7098 43.5842 1.9037 2.2668 14.0204 16.6276 14.5131 56.6648 24.5707 314.1299 1.2860 56.2647 77.3135 26.6224 10.5423 24.6228 8.8827 35.0678 54.7953 28.1101
temp: 298.150 k
press: 1.00000 atm
elementType: 8 8 8 6 6 6 6 6 6 6 6 6 6 1 1 1 1 1 1 1
symmnumber: 1
zpe: 359057.5 jmol-1
zpe.correction: 0.136758 hartree
zpe.thermalcorrener: 0.147985 hartree
zpe.thermalcorrenthalpy: 0.148930 hartree
zpe.thermalcorrgfe: 0.098169 hartree
zpe.sumelectzpe: -609.991544 hartree
zpe.sumelectthermal: -609.980316 hartree
zpe.sumelectthermalent: -609.979372 hartree
zpe.sumelectthermalfe: -610.030133 hartree
dipole: 12.4789 1.0021 0.0022
dipole: 12.5191
quadrupole: -132.8301 -86.9519 -79.1987
quadrupole: 0.6102 0.0098 0.0334
quadrupole: -33.1698 12.7083 20.4615 0.6102 0.0098 0.0334
hfenergy: -610.1283017 hartree
pointgroup: C01 [X(C10H7O3)]
dipole: -4.924533 -0.0916834 0.0011572 debye
dipolederiv: 0.0550085 0.1616051 0.0001942 -0.6791314 -0.9412459 -0.0000187 -0.0026868 -0.0003399 -0.2796508 -0.9736052 0.0568942 -0.0003656 0.2175597 -1.1293617 -0.0026052 -0.0011256 -0.0028167 -0.4177915 -1.4166227 -0.2528528 -0.0023867 -0.147229 -0.676619 -0.0014171 -0.0009329 -0.0013304 -0.4364576 1.0305464 0.1202121 -0.0002954 0.0656522 -0.1803214 -0.00002 -0.0005403 -0.0000257 0.0513938 -1.3121273 -0.1074553 -0.0000232 0.067408 0.1822595 0.0001546 0.0018479 0.0000789 -0.0441626 -0.3062121 -0.2488747 0.0002502 -0.4218595 0.1574289 -0.0000921 0.0001028 -0.0001356 -0.0267497 0.145177 0.0849826 -0.0002595 0.7071513 0.5680211 -0.0002332 0.0003003 0.0006521 0.1019397 -0.3419291 -0.0661763 0.00001 0.2765066 0.0394144 -0.0001265 0.0002186 0.0000169 -0.2086458 0.2684804 0.1576626 -0.0001973 -0.0128639 0.0488317 -0.0000724 -0.0000991 -0.0000639 -0.1946124 -0.0809783 0.1925707 0.0000123 0.1479881 0.0140881 0.0000213 -0.0000987 -0.000102 0.0174625 0.1866788 0.0188173 -0.0000827 -0.0568483 0.1015422 0.0000077 -0.000077 -0.0000573 -0.1828447 -0.32035 -0.0234982 0.0000669 0.0819001 -0.0893831 -0.0000362 0.0000091 -0.0000287 -0.2203804 2.099252 0.0313807 0.0031023 -0.1650653 1.1419956 0.0041638 0.0030357 0.0036955 0.1377735 0.0513523 -0.0826301 0.0000358 -0.0208798 -0.0468832 0.000084 0.0000568 0.0000628 0.1685404 0.0313332 -0.0689599 0.0000402 -0.1381847 -0.1414831 0.0001237 0.000136 0.0001198 0.1488067 0.0822187 0.0555989 -0.0914956 0.0084534 0.0533316 -0.0389736 -0.0654221 0.0030362 -0.0217077 -0.0224063 -0.189985 0.0000817 -0.0731009 -0.1414696 0.0001428 0.0000254 0.0001883 0.1018256 0.0826266 0.0557789 0.0912596 0.0085688 0.0535032 0.0388541 0.0652256 -0.0029687 -0.0213192 -0.0471085 0.1260975 0.0000041 0.1662403 -0.0876355 0.000021 -0.0000109 0.0000033 0.1579531 -0.2113345 -0.0211683 0.0000487 -0.0322655 0.0739861 0.000022 0.0000352 0.0000153 0.168627 unknown
polarizability: 243.6027141|-1.1159716|128.4062566|0.0028503|0.0422341|52.9086369 unknown
InChI: InChI=1S/C10H7O3/c1-6-4-2-3-5-7(6)8-9(13-8)10(11)12/h2-5H,1H3
charge -1 multiplicity 1
20 atoms
O  1.391185 1.873757 0.00022
O  2.814528 -1.740171 -0.00602
O  4.199158 0.172929 0.003589
C  -0.907446 0.35954 -0.000262
C  0.497911 0.562413 -0.000776
C  -1.469642 -0.969779 0.000245
C  1.808162 0.363507 -0.001007
C  -1.772636 1.498826 -0.000383
C  -2.874792 -1.096699 0.000441
C  -0.556331 -2.176297 0.000714
C  -3.171058 1.33577 -0.000075
C  -3.732115 0.035105 0.000273
C  3.080085 -0.464444 -0.000203
H  -1.314915 2.493833 -0.000715
H  -3.309825 -2.104801 0.000837
H  0.126131 -2.173959 0.871009
H  -1.135603 -3.116624 0.001279
H  0.126002 -2.17492 -0.86968
H  -3.824072 2.217111 -0.000124
H  -4.820428 -0.100098 0.000437
