program: Gaussian 09
title: 000152176
version: EM64L-G09RevD.01
frameworkgroup: C1[X(C19H16O2)]
method: RPBEPBE
basis: SDD
operation: Freq
keyword: #pfreq=noraman
keyword: PBEPBE/SDD
title: #p freq=noraman PBEPBE/SDD
converged: YES YES NO NO
title: Mulliken charges:
elementType: O O C C C C C C C C C C C C C C C C C C C H H H H H H H H H H H H H H H H
charge: -0.442482 -0.437500 0.301079 -0.316024 0.271885 0.430544 0.274523 -0.188126 -0.645955 -0.668842 0.162097 0.331365 -0.387593 0.461552 -0.231185 -0.771633 -0.355898 -0.852867 -0.457300 -0.262031 -0.249564 0.237957 0.262587 0.237820 0.256033 0.237138 0.236613 0.237947 0.223888 0.245639 0.234740 0.232866 0.244923 0.344931 0.340560 0.229384 0.230925
chargesum: 0.00000
title: Mulliken charges with hydrogens summed into heavy atoms:
elementType: O O C C C C C C C C C C C C C C C C C C C
charge: -0.097551 -0.096940 0.301079 -0.078067 0.271885 0.430544 0.274523 0.074461 -0.408135 -0.412809 0.162097 0.331365 -0.150455 0.461552 0.005428 -0.533685 -0.132010 -0.139621 -0.212377 -0.032647 -0.018639
polarizability: 3.74808832e+02 2.01710188e+01 2.36520583e+02 3.13051856e+00 2.37668374e+00 1.06493446e+02
1716.lowfreq: -4.9931 0.0003 0.0004 0.0007 2.1102 5.6585 46.1099 48.8815 81.9668
frequency: 46.0462 48.8402 81.9648 109.1070 130.3862 143.1940 166.9838 205.8346 217.1633 223.5604 250.5012 263.1649 285.2690 311.9931 317.3625 333.0966 352.4398 370.3053 425.0081 431.8366 454.0803 467.1120 504.6195 531.8254 545.8594 554.9944 570.3380 590.2787 606.1991 636.1296 653.4408 706.0718 715.9729 746.9716 760.9313 771.9026 793.5381 818.1465 854.4184 865.3338 869.4160 883.4100 910.5709 919.5105 924.9568 937.7483 946.9509 959.1245 961.7428 982.7023 990.3934 1000.8353 1035.5950 1050.5242 1053.5535 1078.2381 1115.1082 1158.7799 1163.3082 1177.5342 1188.3287 1202.7124 1218.7139 1223.0628 1249.4661 1275.8320 1277.9819 1293.3031 1311.7780 1328.1371 1337.7001 1348.4058 1365.3032 1390.7268 1398.9841 1404.9080 1412.5761 1433.8098 1445.2911 1465.4014 1472.7897 1483.2630 1498.8168 1525.4809 1574.0504 1609.3363 1622.1158 1626.5950 1640.9124 2971.8118 2984.7322 3046.0929 3071.5793 3086.6736 3113.4630 3117.1086 3122.5555 3127.9685 3135.4205 3141.4848 3150.6562 3154.7170 3165.7179 3541.9084 3559.2759
redmass: 5.5863 4.9378 4.4032 4.0871 5.9128 4.1941 4.3431 1.1928 3.3687 1.1555 3.3417 3.6704 3.8791 2.1952 1.4378 4.1453 4.6643 4.6213 3.3074 5.3992 3.3642 4.7915 4.1879 4.0461 3.8968 4.0949 4.6464 3.5767 5.4647 5.7638 5.0922 4.0948 5.7355 3.2616 1.3056 3.0218 2.2414 1.9172 4.1261 2.6476 1.5319 4.2129 1.5807 1.5660 2.4606 4.4162 4.4702 4.4397 1.4717 1.3316 1.3498 1.9278 2.5223 2.0864 1.6056 2.2321 2.0528 1.4887 1.3804 1.0877 1.2445 1.3260 1.5106 1.4183 2.0650 1.3342 2.6295 1.4214 1.8079 2.6002 1.7345 1.2109 2.4199 2.1145 1.6561 2.3894 3.4468 3.0619 2.6956 3.5317 1.0459 1.2825 3.1474 4.0566 7.7702 5.8031 6.7932 6.4380 7.0362 1.0381 1.0851 1.0972 1.0854 1.0979 1.0874 1.0913 1.0867 1.0898 1.0885 1.0905 1.0931 1.0975 1.0999 1.0664 1.0665
irintensity: 0.3138 0.7908 1.3560 3.4470 0.6822 0.2088 0.8414 0.7085 3.1988 105.3796 14.3269 0.1355 0.8379 35.0612 66.6673 0.3915 15.3157 5.5334 8.5039 1.7125 1.7410 1.8958 0.3390 3.1487 2.2887 0.9668 5.9364 7.5236 5.8118 3.7849 1.1723 6.3509 0.6430 14.1747 53.7710 21.5760 7.9221 7.9341 5.0833 110.6734 1.3910 8.7875 11.6045 49.9865 10.2584 41.1711 15.5446 48.5687 15.9841 2.5683 0.2775 2.7329 18.8197 8.2987 7.0151 0.8536 0.9962 31.2727 4.6548 3.7308 31.5128 28.9540 22.5406 4.1672 10.9349 4.9002 7.2059 0.6439 6.4087 10.2384 6.1820 51.9010 9.5373 5.4294 15.3732 5.7247 9.0752 4.7742 6.3200 13.0825 14.7721 4.9757 19.9512 1.4583 1.8225 4.0067 7.6101 4.9024 2.4355 34.0545 34.6554 18.4960 13.2349 18.9295 9.8825 13.6824 9.9106 12.2450 2.0271 10.5846 32.4192 27.1987 36.4911 11.8500 6.9382
temp: 298.150 k
press: 1.00000 atm
elementType: 8 8 6 6 6 6 6 6 6 6 6 6 6 6 6 6 6 6 6 6 6 1 1 1 1 1 1 1 1 1 1 1 1 1 1 1 1
symmnumber: 1
zpe: 772184.5 jmol-1
zpe.correction: 0.294110 hartree
zpe.thermalcorrener: 0.311369 hartree
zpe.thermalcorrenthalpy: 0.312313 hartree
zpe.thermalcorrgfe: 0.249868 hartree
zpe.sumelectzpe: -882.623245 hartree
zpe.sumelectthermal: -882.605985 hartree
zpe.sumelectthermalent: -882.605041 hartree
zpe.sumelectthermalfe: -882.667486 hartree
dipole: -3.3088 2.1412 -0.0696
dipole: 3.9418
quadrupole: -125.7011 -108.5433 -129.0159
quadrupole: 9.9717 -0.1636 -2.3360
quadrupole: -4.6143 12.5434 -7.9291 9.9717 -0.1636 -2.3360
hfenergy: -882.9173543 hartree
pointgroup: C01 [X(C19H16O2)]
dipole: 1.2704494 0.8893175 0.0114925 debye
polarizability: 376.08325|-15.0543608|235.1153572|3.6123932|-4.6475022|106.6242549 unknown
InChI: InChI=1S/C19H16O2/c1-11-8-12-4-2-3-5-14(12)17-10-16-13(9-15(11)17)6-7-18(20)19(16)21/h2-10,18-21H,1H3
charge 0 multiplicity 1
37 atoms
O  -3.187568 -1.71764 -1.720731
O  -4.402187 -1.277695 1.720231
C  -1.734414 -0.52999 -0.116788
C  -2.909686 -1.478729 -0.276542
C  0.712395 -0.145491 -0.011914
C  -1.970881 0.887494 -0.129957
C  0.477174 1.280462 -0.065392
C  -4.244729 -0.937021 0.280853
C  -0.424109 -1.013157 -0.038079
C  -0.867953 1.757631 -0.112947
C  2.081452 -0.656448 0.060083
C  1.602543 2.210088 -0.057871
C  -3.354059 1.384205 -0.107892
C  3.170235 0.288395 0.066052
C  -4.421987 0.551717 0.07373
C  2.890573 1.70338 0.00472
C  2.399026 -2.048943 0.124234
C  1.367134 3.70754 -0.118541
C  4.517932 -0.182637 0.132502
C  3.727519 -2.491179 0.18964
C  4.799181 -1.55231 0.193221
H  -2.698046 -2.446928 0.221157
H  -5.05047 -1.505239 -0.211838
H  -0.277484 -2.098731 -0.002617
H  -1.050049 2.837645 -0.123985
H  -3.506362 2.467054 -0.202108
H  -5.441665 0.947152 0.13414
H  3.743238 2.394122 0.010181
H  1.599317 -2.795923 0.125901
H  2.324648 4.254143 -0.112424
H  0.819026 3.999103 -1.0348
H  0.771524 4.063889 0.743761
H  5.333405 0.550411 0.135463
H  -2.321868 -1.798245 -2.196692
H  -3.876535 -0.625458 2.252254
H  3.943143 -3.564038 0.239172
H  5.835186 -1.904129 0.244023
