program: Gaussian 09
title: 000152175
version: EM64L-G09RevD.01
frameworkgroup: C1[X(C19H16O2)]
method: RPBEPBE
basis: SDD
operation: Freq
keyword: #pfreq=noraman
keyword: PBEPBE/SDD
title: #p freq=noraman PBEPBE/SDD
converged: YES YES NO NO
title: Mulliken charges:
elementType: O O C C C C C C C C C C C C C C C C C C C H H H H H H H H H H H H H H H H
charge: -0.452995 -0.426907 0.334372 -0.287250 0.122758 0.280913 -0.237863 0.293896 0.314167 -0.693374 -0.298514 -0.194638 -0.679873 -0.682378 0.421809 0.430953 -0.850166 -0.431950 -0.436301 -0.245851 -0.242763 0.209232 0.236023 0.243503 0.215189 0.226608 0.233749 0.254229 0.236481 0.243813 0.233001 0.348309 0.243793 0.243074 0.336496 0.229413 0.229043
chargesum: 0.00000
title: Mulliken charges with hydrogens summed into heavy atoms:
elementType: O O C C C C C C C C C C C C C C C C C C C
charge: -0.104686 -0.090411 0.334372 -0.078018 0.122758 0.280913 -0.001840 0.293896 0.314167 -0.449871 -0.083325 0.031970 -0.446124 -0.428149 0.421809 0.430953 -0.136871 -0.188158 -0.193228 -0.016438 -0.013720
polarizability: 3.88371731e+02 -7.31868182e+00 2.38863939e+02 1.89367301e-01 -5.63460084e+00 1.03855631e+02
1716.lowfreq: -9.7404 -5.8857 -0.0008 -0.0006 -0.0005 1.9769 40.0476 45.8364 73.2441
frequency: 39.9969 45.7889 73.2406 98.7049 127.8079 143.2454 185.0268 194.0831 198.8057 227.2992 241.7977 251.9205 263.7685 272.0509 307.1873 318.5646 366.1602 380.0312 419.5031 429.8006 468.8649 473.8677 490.6605 503.3273 549.0873 552.8108 570.6338 598.8165 618.1825 631.8023 648.4655 700.7233 711.6876 754.2348 759.9006 781.1159 782.2535 824.7721 834.1287 861.4539 878.9828 887.1921 898.9606 903.3557 922.8681 935.7807 952.7814 967.8408 971.7503 978.5292 990.7255 991.9328 1014.4159 1041.8172 1045.7307 1062.7548 1128.1565 1144.1322 1171.4256 1171.8634 1182.0400 1194.0683 1215.8494 1230.8585 1235.9465 1260.4987 1285.3823 1295.4494 1308.2187 1323.1593 1333.6711 1354.7247 1381.4929 1393.1902 1399.8570 1412.1010 1415.8911 1431.4832 1445.9377 1453.8567 1470.2785 1477.2524 1486.3008 1554.2505 1562.7367 1590.6031 1612.8814 1636.5455 1648.2469 2949.9499 2968.5646 2970.1101 3043.4322 3084.7965 3104.8140 3118.9907 3123.7973 3134.6046 3138.7224 3142.6639 3147.4398 3161.9414 3165.1650 3539.0815 3558.5436
redmass: 5.3679 5.0713 4.1685 4.1093 5.0046 4.6733 2.2355 1.5489 1.1272 3.5357 4.0408 4.2966 1.1029 3.7043 4.0203 4.3210 4.0395 4.3907 3.4516 5.3808 2.5746 4.6057 4.9418 4.5735 3.9450 4.1074 4.9683 3.4703 6.3934 4.8786 5.3873 5.0320 5.1946 1.4135 1.7841 2.7808 3.5536 2.0850 4.0240 1.6761 3.7383 1.6215 2.3236 1.8774 4.9941 2.2942 4.1137 1.4436 2.2831 1.8283 1.3505 2.0945 2.2932 2.5995 1.5853 2.2462 1.9841 1.9518 1.0875 1.0826 1.0784 1.2758 1.6544 1.4544 1.5111 1.1826 2.3242 1.5908 2.5004 1.4242 2.2565 1.8264 2.2875 2.1676 1.7400 2.6172 2.3880 2.9410 5.9606 3.0517 1.0460 1.9778 1.4303 5.9841 7.3656 5.4602 6.5544 6.5356 7.1555 1.0843 1.0831 1.0381 1.0971 1.0979 1.0907 1.0859 1.0890 1.0865 1.0902 1.0948 1.0890 1.1002 1.0973 1.0663 1.0665
irintensity: 0.4731 0.1998 0.1863 0.9811 0.1514 1.3091 53.0037 42.2222 50.3564 0.1048 0.7603 4.0046 175.9363 9.8913 1.4460 2.8600 16.9697 2.4586 0.2384 2.5297 18.0463 2.2766 0.1944 5.5983 1.3102 12.3922 4.8153 3.0585 2.5272 4.3948 0.3812 17.7877 2.3893 19.2446 48.1859 2.3228 1.7886 8.6651 10.5444 0.8741 6.7419 12.7722 66.8646 38.7850 66.9451 2.2145 10.3849 3.4090 77.2601 19.8917 0.0022 6.3302 4.6264 8.0098 4.4351 5.0171 25.7786 13.9417 9.8816 17.9392 53.4959 21.9131 8.4400 16.3881 27.0172 0.5481 2.0387 8.8116 9.1957 1.5830 12.0762 28.0092 0.6125 5.2756 11.2453 5.4961 20.6784 0.6036 1.3634 14.5160 13.8798 17.7256 1.4828 2.0082 2.5023 3.9748 6.9566 2.1027 0.8984 64.4661 26.5271 37.7780 18.0732 17.4680 25.2268 2.9876 0.1125 2.7101 4.7952 33.9765 2.3022 46.1235 31.7085 2.8429 7.5433
temp: 298.150 k
press: 1.00000 atm
elementType: 8 8 6 6 6 6 6 6 6 6 6 6 6 6 6 6 6 6 6 6 6 1 1 1 1 1 1 1 1 1 1 1 1 1 1 1 1
symmnumber: 1
zpe: 769844.6 jmol-1
zpe.correction: 0.293218 hartree
zpe.thermalcorrener: 0.310690 hartree
zpe.thermalcorrenthalpy: 0.311634 hartree
zpe.thermalcorrgfe: 0.248465 hartree
zpe.sumelectzpe: -882.609850 hartree
zpe.sumelectthermal: -882.592379 hartree
zpe.sumelectthermalent: -882.591435 hartree
zpe.sumelectthermalfe: -882.654604 hartree
dipole: 1.1068 1.9129 0.4472
dipole: 2.2548
quadrupole: -107.4996 -105.7593 -132.6001
quadrupole: -4.8816 1.8447 -2.9273
quadrupole: 7.7868 9.5270 -17.3138 -4.8816 1.8447 -2.9273
hfenergy: -882.9030687 hartree
pointgroup: C01 [X(C19H16O2)]
dipole: 0.4245255 -0.7584459 -0.1774669 debye
polarizability: 388.4747812|5.4894687|238.6568901|-3.6993641|-6.3348109|103.9596294 unknown
InChI: InChI=1S/C19H16O2/c1-11-8-17-14(6-7-18(20)19(17)21)16-10-13-5-3-2-4-12(13)9-15(11)16/h2-10,18-21H,1H3
charge 0 multiplicity 1
37 atoms
O  -4.105716 -0.474109 -1.600445
O  -4.61715 1.210327 1.611011
C  -2.216939 -0.568025 -0.009216
C  -3.70248 -0.311709 -0.171793
C  -1.295332 0.490974 -0.077548
C  0.130005 0.190578 -0.037654
C  -4.184935 1.110734 0.19574
C  0.568473 -1.202919 0.078078
C  -0.418672 -2.26396 0.174453
C  -1.769467 -1.921581 0.130717
C  -1.809034 1.868023 -0.142475
C  -3.132129 2.168263 -0.00522
C  1.119734 1.202539 -0.109567
C  1.956446 -1.488266 0.106164
C  2.506488 0.913523 -0.082475
C  2.939144 -0.472297 0.026725
C  0.004263 -3.712267 0.326181
C  3.505824 1.948921 -0.16052
C  4.350576 -0.760572 0.052019
C  4.861261 1.634783 -0.133475
C  5.288412 0.264566 -0.026182
H  -4.270621 -1.048217 0.436361
H  -5.044867 1.314084 -0.478092
H  -2.525888 -2.713812 0.212963
H  -1.100708 2.691667 -0.274228
H  -3.474202 3.208582 -0.003564
H  0.824038 2.253377 -0.189756
H  2.289697 -2.528128 0.192491
H  0.60763 -3.867088 1.241172
H  -0.875997 -4.37346 0.389264
H  0.620221 -4.052352 -0.52852
H  -3.514449 -1.149824 -2.020691
H  3.179355 2.992686 -0.241912
H  4.675033 -1.80487 0.134811
H  -5.504587 0.77531 1.698366
H  5.6132 2.429191 -0.193369
H  6.359572 0.03573 -0.006016
