program: Gaussian 09
title: 000152167
version: EM64L-G09RevD.01
frameworkgroup: C1[X(C12H10N4O2)]
method: RPBEPBE
basis: SDD
operation: Freq
keyword: #p
keyword: freq=noraman
keyword: PBEPBE/SDD
title: #p freq=noraman PBEPBE/SDD
converged: YES YES NO YES
title: Mulliken charges:
elementType: O O N N N N C C C C C C C C C C C C H H H H H H H H H H
charge: -0.210513 -0.201350 -0.221131 -0.043940 0.005731 0.027062 -0.023575 0.020431 0.039653 0.255056 0.332304 -0.189166 0.231424 -0.331642 -0.221052 -0.772857 -0.477390 -0.777325 0.284180 0.247115 0.236571 0.263510 0.255434 0.255469 0.299967 0.216908 0.249560 0.249566
chargesum: 0.00000
title: Mulliken charges with hydrogens summed into heavy atoms:
elementType: O O N N N N C C C C C C C C C C C C
charge: -0.210513 -0.201350 -0.221131 -0.043940 0.005731 0.027062 -0.023575 0.020431 0.039653 0.255056 0.332304 0.095014 0.231424 -0.084527 0.015519 0.001555 -0.177423 -0.061291
polarizability: 3.03998952e+02 -5.00692830e+00 1.81676975e+02 8.24076357e-04 6.45330613e-03 7.07757455e+01
1716.lowfreq: -24.1671 -8.3367 -7.0569 -0.0010 -0.0009 0.0002 5.1890 58.5027 85.0873
frequency: -23.9530 58.4993 85.0868 117.8133 132.2958 139.8604 198.7911 205.4531 241.3596 253.9121 264.8747 301.6989 313.2511 336.6477 370.6233 437.7670 502.6594 512.5893 515.7561 539.5800 568.0046 575.7324 585.4245 603.6902 642.6528 693.2665 713.8001 748.8803 752.8674 777.5732 790.1852 817.5953 859.8620 897.3793 899.8430 925.9460 958.1592 976.0913 1020.0564 1031.3813 1032.1595 1049.9857 1079.1386 1131.6799 1159.0013 1184.3707 1200.7857 1235.2417 1255.0505 1275.9008 1308.8748 1321.9064 1357.2665 1371.4297 1378.5846 1396.9622 1405.5074 1435.9011 1447.3022 1453.9037 1456.3278 1457.7596 1469.6475 1494.9547 1542.1789 1560.1066 1576.8890 1628.8341 2989.2582 3001.2209 3068.7504 3079.5824 3102.6179 3119.0467 3148.1846 3178.0426 3190.4432 3200.6325
redmass: 10.0121 6.8718 3.0598 1.0991 5.0557 5.0864 1.4897 1.8139 4.6118 4.0322 8.2539 2.9858 4.9262 8.0458 5.5042 7.1952 5.8833 4.0265 7.3307 3.8227 5.4279 4.2980 4.9343 8.0187 5.0297 8.7479 8.2794 4.0715 11.7511 1.6905 4.3549 7.0564 4.9159 4.0050 1.3265 1.4146 1.3212 2.0537 3.3914 1.5625 2.0823 1.5280 1.7620 4.7370 1.4728 6.5517 3.6157 5.5406 2.4503 3.1133 2.6728 3.0935 5.0453 4.9173 2.5514 1.2687 1.2647 2.9443 1.4285 1.0437 2.9376 1.0482 1.4144 3.0307 9.8292 6.6718 6.6185 6.4916 1.0367 1.0365 1.0967 1.0951 1.1006 1.1021 1.0907 1.0898 1.0920 1.1008
irintensity: 0.0140 0.0528 0.3736 0.8087 0.2522 7.2718 2.0899 0.0378 2.1000 5.7191 1.4584 3.7632 0.0109 0.7595 2.5738 1.0313 2.7282 0.9057 3.0386 6.5008 2.2888 1.1490 0.0079 0.3700 4.1810 11.3504 5.9866 25.5905 32.3933 47.5656 6.1752 1.0363 11.2211 1.4911 0.2364 16.0569 0.2991 4.4826 4.4238 4.0219 0.6782 8.2309 11.4713 8.5928 3.1045 52.1792 237.7173 139.7501 35.7088 24.1755 29.2089 63.3604 62.7333 88.2779 27.8624 48.1293 21.4714 49.4996 9.8852 18.0221 7.3364 10.7742 1.8711 35.0436 21.7456 13.4014 84.4118 47.3195 17.3561 2.1035 10.3057 4.4593 20.9882 8.5628 12.1719 4.2478 3.6000 5.4790
temp: 298.150 k
press: 1.00000 atm
elementType: 8 8 7 7 7 7 6 6 6 6 6 6 6 6 6 6 6 6 1 1 1 1 1 1 1 1 1 1
symmnumber: 1
zpe: 538991.5 jmol-1
zpe.correction: 0.205291 hartree
zpe.thermalcorrener: 0.219120 hartree
zpe.thermalcorrenthalpy: 0.220064 hartree
zpe.thermalcorrgfe: 0.164918 hartree
zpe.sumelectzpe: -831.403481 hartree
zpe.sumelectthermal: -831.389652 hartree
zpe.sumelectthermalent: -831.388708 hartree
zpe.sumelectthermalfe: -831.443854 hartree
dipole: 7.2756 -0.1559 -0.0002
dipole: 7.2772
quadrupole: -110.0803 -101.2848 -104.3906
quadrupole: -4.5227 0.0024 -0.0033
quadrupole: -4.8284 3.9671 0.8613 -4.5227 0.0024 -0.0033
hfenergy: -831.6087718 hartree
pointgroup: C01 [X(C12H10N4O2)]
dipole: -2.8628499 0.0368442 0.0001007 debye
polarizability: 304.0756972|-3.959254|181.6002209|-0.0141636|0.0313446|70.7757547 unknown
InChI: InChI=1S/C12H10N4O2/c1-7-4-3-5-15-11(7)14-10-8(2)9(16(17)18)6-13-12(10)15/h3-6H,1-2H3
charge 0 multiplicity 1
28 atoms
O  4.671053 1.155754 -0.000934
O  4.462137 -1.108752 -0.000168
N  -1.544377 0.831679 -0.000086
N  -0.889971 -1.398272 -0.001023
N  0.675821 1.900776 0.000171
N  3.952754 0.079492 -0.000687
C  0.232033 -0.561992 -0.000747
C  -0.143503 0.824152 -0.000173
C  -1.953008 -0.548439 -0.000605
C  1.614687 -0.906954 -0.000985
C  -3.358238 -0.845069 -0.000626
C  -2.438465 1.892716 0.00039
C  2.478192 0.228476 -0.000596
C  -4.24568 0.234312 -0.000146
C  -3.791267 1.601742 0.000366
C  2.002544 -2.364225 -0.001674
C  1.992717 1.579894 -0.000047
C  -3.788135 -2.291439 -0.001129
H  -2.004234 2.89438 0.00076
H  -5.322716 0.035812 -0.000155
H  -4.51191 2.422912 0.000738
H  1.089106 -2.978823 -0.002531
H  2.62389 -2.613491 -0.879303
H  2.622808 -2.614544 0.876436
H  2.713633 2.39967 0.000212
H  -4.886952 -2.382093 -0.001322
H  -3.385702 -2.819149 0.882613
H  -3.385417 -2.818627 -0.885048
