program: Gaussian 09
title: 000152163
version: EM64L-G09RevD.01
frameworkgroup: C1[X(C16H11NO2)]
method: RPBEPBE
basis: SDD
operation: Freq
keyword: #p
keyword: freq=noraman
keyword: PBEPBE/SDD
title: #p freq=noraman PBEPBE/SDD
converged: NO NO NO NO
title: Mulliken charges:
elementType: O O N C C C C C C C C C C C C C C C C H H H H H H H H H H H
charge: -0.278149 -0.429632 -0.062773 0.086887 0.244166 0.480344 0.123562 0.438221 -0.032548 -0.503018 -0.469556 -0.487877 -0.528350 -0.350265 -0.428066 0.220285 0.293338 -0.416612 -0.764000 0.241526 0.244505 0.238652 0.309363 0.255288 0.239965 0.221897 0.248379 0.260762 0.248380 0.355325
chargesum: 0.00000
title: Mulliken charges with hydrogens summed into heavy atoms:
elementType: O O N C C C C C C C C C C C C C C C C
charge: -0.278149 -0.074307 -0.062773 0.086887 0.244166 0.480344 0.123562 0.438221 -0.032548 -0.261491 -0.225051 -0.249224 -0.218987 -0.094977 -0.188101 0.220285 0.293338 -0.194715 -0.006478
polarizability: 2.88209528e+02 9.51727446e+00 2.43429864e+02 7.30310354e-03 -9.01778122e-03 7.54197708e+01
1716.lowfreq: -0.0010 -0.0008 0.0004 6.5457 7.0215 7.2521 55.5209 91.1469 107.3024
frequency: 55.5064 91.1315 107.2991 122.1909 125.2143 186.7373 202.1027 227.6302 285.7299 311.3047 326.2729 349.1654 354.1006 378.2973 416.1871 436.6028 438.5430 477.6558 505.2977 519.6342 552.4240 582.8564 611.2292 630.8671 651.0146 671.7395 682.0763 718.8660 743.6541 745.3780 786.2146 809.7408 826.8945 832.1260 834.3682 850.8208 863.2530 910.8546 939.5380 955.9305 965.3302 984.3851 990.2126 1010.6688 1047.9465 1089.1030 1114.5817 1140.2651 1156.4952 1164.0564 1189.7969 1218.0006 1229.5862 1238.2636 1260.2956 1270.9182 1306.7523 1375.1511 1397.6851 1400.5515 1411.1248 1436.2701 1440.5443 1450.3174 1454.8975 1461.6787 1512.5655 1533.0346 1553.2052 1588.8367 1612.1838 1626.1022 1638.3732 2994.6444 3072.7722 3111.1829 3119.6565 3129.7212 3133.4919 3139.8302 3145.0936 3175.7531 3195.9343 3580.0038
redmass: 4.9359 3.3578 1.2183 5.0823 3.8763 4.1458 6.2737 4.6092 4.8564 4.8128 4.9332 3.9018 1.1638 5.6800 5.6371 5.6829 3.2072 5.1118 3.8569 5.2280 3.3174 4.9573 4.2593 5.3904 7.0891 3.5227 6.2483 6.2859 2.9842 7.1591 1.4608 2.4547 5.3317 2.1454 6.0829 8.6594 1.6127 1.5441 1.3472 4.8814 1.3517 1.4124 2.7577 2.7501 1.4832 2.8887 2.6575 1.3648 1.2824 1.2831 2.5414 2.1339 2.0083 2.1171 3.1850 2.3215 2.1565 3.1475 1.6100 2.7996 3.1712 2.9290 3.6661 3.1624 1.0441 1.2311 3.6252 5.6200 7.4675 7.9014 7.3814 7.9616 6.4500 1.0381 1.0977 1.0877 1.0862 1.0985 1.0897 1.0970 1.0979 1.0963 1.0919 1.0661
irintensity: 0.6102 1.6586 1.9188 0.9020 2.0562 1.0478 2.4518 2.6000 0.0619 0.7526 7.6636 35.4763 107.5950 1.1414 1.7925 5.9785 2.7636 0.8603 3.3421 1.3205 18.1241 1.7786 9.8736 1.7266 7.3951 0.8845 6.7583 10.1627 0.0011 5.9626 14.3783 3.4070 30.1160 11.3856 41.0233 19.7979 103.7515 20.5646 6.8151 31.6523 1.1524 0.0100 6.2254 14.5126 5.0851 0.1232 34.7541 76.6112 152.1118 44.4556 40.4588 7.4254 9.4399 7.8602 41.0857 4.3438 32.8411 14.2819 5.1392 8.8994 2.1647 5.3133 0.0995 40.2042 18.9339 6.9205 73.2268 25.3450 5.3100 56.8220 3.2333 1.7353 87.1890 12.9950 9.5637 13.2095 0.6742 4.2983 6.8656 19.3665 38.2743 10.0302 6.9276 55.8520
temp: 298.150 k
press: 1.00000 atm
elementType: 8 8 7 6 6 6 6 6 6 6 6 6 6 6 6 6 6 6 6 1 1 1 1 1 1 1 1 1 1 1
symmnumber: 1
zpe: 593250.3 jmol-1
zpe.correction: 0.225957 hartree
zpe.thermalcorrener: 0.240369 hartree
zpe.thermalcorrenthalpy: 0.241314 hartree
zpe.thermalcorrgfe: 0.185068 hartree
zpe.sumelectzpe: -820.239218 hartree
zpe.sumelectthermal: -820.224806 hartree
zpe.sumelectthermalent: -820.223862 hartree
zpe.sumelectthermalfe: -820.280108 hartree
dipole: -2.8846 -0.3702 0.0001
dipole: 2.9083
quadrupole: -92.1630 -92.3854 -114.5918
quadrupole: 0.1307 0.0002 -0.0018
quadrupole: 7.5504 7.3280 -14.8784 0.1307 0.0002 -0.0018
hfenergy: -820.4651752 hartree
pointgroup: C01 [X(C16H11N1O2)]
dipole: 1.140317 0.0941751 0.0000575 debye
polarizability: 288.9776948|7.4558815|242.6616967|-0.0068879|0.0093387|75.4197708 unknown
InChI: InChI=1S/C16H11NO2/c1-9-17-14-7-5-11-3-2-10-4-6-12(18)8-13(10)15(11)16(14)19-9/h2-8,18H,1H3
charge 0 multiplicity 1
30 atoms
O  -1.505283 1.56611 0.000301
O  2.993329 3.136351 0.000233
N  -3.63917 0.678083 0.000283
C  -0.187413 -0.621589 0.000136
C  1.177687 -0.100126 0.000123
C  -0.419814 -2.052198 0.000073
C  -1.374702 0.152227 0.000209
C  2.275418 -1.042891 0.00004
C  -2.68904 -0.380675 0.000232
C  0.715349 -2.946587 -0.000022
C  -1.752837 -2.593205 0.000098
C  2.009313 -2.461743 -0.000051
C  1.465969 1.295788 0.000191
C  -2.892355 -1.783795 0.000179
C  3.614525 -0.54788 0.000021
C  -2.920655 1.791496 0.000334
C  2.794465 1.744194 0.000164
C  3.88472 0.823663 0.000069
C  -3.37893 3.20817 0.000413
H  0.523463 -4.025748 -0.000071
H  -1.8594 -3.684063 0.000049
H  2.861583 -3.151617 -0.000104
H  0.663033 2.034431 0.000288
H  -3.903712 -2.198752 0.000179
H  4.442106 -1.266811 -0.000052
H  4.920025 1.189399 0.00005
H  -3.008155 3.747744 -0.889881
H  -4.478983 3.223999 0.000081
H  -3.008729 3.74746 0.891126
H  3.958194 3.355966 0.000308
