program: Gaussian 09
title: 000152160
version: EM64L-G09RevD.01
frameworkgroup: C1[X(C3H8N2O)]
method: RPBEPBE
basis: SDD
operation: Freq
keyword: #pfreq=noraman
keyword: PBEPBE/SDD
title: #p freq=noraman PBEPBE/SDD
converged: YES YES NO NO
title: Mulliken charges:
elementType: O N N C C C H H H H H H H H
charge: -0.304687 0.072070 -0.062366 -0.307841 -0.648897 -0.655042 0.244069 0.239250 0.252696 0.226853 0.217152 0.247568 0.231315 0.247860
chargesum: 0.00000
title: Mulliken charges with hydrogens summed into heavy atoms:
elementType: O N N C C C
charge: -0.304687 0.072070 -0.062366 0.175478 0.047803 0.071701
polarizability: 6.81596503e+01 4.57418888e+00 5.30057879e+01 -3.26138851e+00 -7.01667815e-01 3.82002422e+01
1716.lowfreq: -8.6606 -3.8206 -0.0011 -0.0003 -0.0002 7.8052 56.3954 157.4343 184.0143
frequency: 56.1503 157.4248 184.0136 215.1898 289.7732 335.6311 432.9698 577.8436 660.0583 802.1954 831.9512 956.8901 1012.5654 1044.1814 1096.4957 1121.4264 1146.1224 1230.5065 1249.2053 1335.0796 1383.8042 1391.1713 1433.4624 1446.0053 1457.4466 1458.1749 1468.5037 1487.2612 2962.8508 2999.8654 3033.4131 3035.8537 3097.0560 3104.9202 3127.3239 3128.5563
redmass: 2.6913 1.0686 2.5745 1.1752 2.5265 3.6411 3.2797 4.3408 4.1948 1.1725 3.3163 3.8476 2.2589 1.3777 2.2407 1.6604 1.7216 3.8728 1.5377 1.3852 1.5241 1.2321 1.4605 1.0472 1.3255 1.1078 1.0854 1.0519 1.0359 1.0354 1.0619 1.0973 1.0992 1.1012 1.1036 1.0991
irintensity: 1.0324 0.6539 2.7719 1.4699 13.8892 18.5088 1.7987 6.7167 1.1159 4.3563 5.5226 4.2458 17.2777 0.2572 8.0339 12.5126 3.6572 34.7468 2.5182 3.2415 55.8725 12.8586 10.9914 18.0783 52.6193 9.7090 4.3980 12.5681 18.8531 20.3849 11.0485 27.1837 23.8264 6.5002 16.8096 20.5477
temp: 298.150 k
press: 1.00000 atm
elementType: 8 7 7 6 6 6 1 1 1 1 1 1 1 1
symmnumber: 1
zpe: 303560.4 jmol-1
zpe.correction: 0.115620 hartree
zpe.thermalcorrener: 0.122835 hartree
zpe.thermalcorrenthalpy: 0.123780 hartree
zpe.thermalcorrgfe: 0.084390 hartree
zpe.sumelectzpe: -303.270412 hartree
zpe.sumelectthermal: -303.263197 hartree
zpe.sumelectthermalent: -303.262253 hartree
zpe.sumelectthermalfe: -303.301642 hartree
dipole: 0.8198 -1.2401 -0.0034
dipole: 1.4866
quadrupole: -29.4670 -42.6604 -35.6089
quadrupole: -1.6735 -1.2134 0.6809
quadrupole: 6.4451 -6.7483 0.3032 -1.6735 -1.2134 0.6809
hfenergy: -303.3860322 hartree
pointgroup: C01 [X(C3H8N2O1)]
dipole: 0.3398312 0.4000167 0.258015 debye
dipolederiv: -0.5141919 -0.0456272 -0.0569913 0.3091211 -0.687618 -0.2207354 0.1650494 -0.2722892 -0.3990359 0.3741472 -0.1563756 -0.0114977 -0.3362259 0.6647011 0.3643433 -0.0715446 0.3906033 0.205282 -0.3378669 0.1887887 0.132203 0.1654474 -0.4452107 -0.0875829 0.0798454 -0.0830002 -0.2982997 0.2592906 -0.0172002 -0.0134961 0.0611366 0.1758135 -0.0505889 0.017837 -0.0574417 0.1800271 -0.0364184 -0.0039194 0.0409594 -0.0312261 0.0494463 -0.022297 -0.0056644 -0.0135858 -0.0289763 0.161699 -0.1074904 -0.0782631 -0.2093626 0.1830985 -0.0618897 -0.1516604 -0.0419507 0.1606472 0.0192106 0.0358245 0.0334899 -0.0179624 -0.0065848 -0.0935341 0.0054616 -0.0674655 0.0427615 0.0165822 -0.0078412 -0.0173494 0.0082343 -0.0211295 0.1259548 -0.0296235 0.0725599 -0.0008778 0.1404656 -0.0235615 -0.0050568 0.034069 -0.036976 -0.0948941 0.0320479 -0.0643911 0.0392786 0.0807375 0.0638612 -0.0307349 0.0324339 -0.0397461 0.1185935 0.0174877 0.1028857 -0.0098897 -0.1406746 -0.0397556 -0.0681033 -0.0450157 0.1150096 -0.0045491 -0.0683713 -0.0098574 0.0572401 0.0057675 0.0189277 0.0476381 -0.0060596 0.1074854 -0.0159697 -0.0592344 0.0307705 -0.1078892 -0.0230874 0.0793897 0.0257836 0.1338467 -0.0014243 -0.0470008 0.0554923 -0.0568387 0.0901157 -0.005661 0.0149793 0.0014186 -0.0984367 -0.0568648 0.0901501 0.0128775 0.0700008 0.0696162 unknown
polarizability: 67.965515|-5.6061008|49.247306|-0.8448531|6.8175566|42.1528593 unknown
InChI: InChI=1S/C3H8N2O/c1-3-5(6)4-2/h3H2,1-2H3
charge 0 multiplicity 1
14 atoms
O  -0.225727 -1.177412 -0.668701
N  -0.085369 -0.090081 0.062769
N  -1.035167 0.752878 0.408027
C  1.300474 0.23046 0.568796
C  2.298344 0.325214 -0.594413
C  -2.360922 0.352638 -0.123582
H  1.215127 1.169514 1.135671
H  1.572756 -0.592931 1.252355
H  2.301932 -0.613349 -1.172647
H  2.042846 1.158519 -1.271694
H  3.312263 0.501686 -0.194492
H  -2.349871 0.28733 -1.229908
H  -3.083399 1.111661 0.208782
H  -2.657487 -0.649927 0.244237
