program: Gaussian 09
title: 000152155
version: EM64L-G09RevD.01
frameworkgroup: C1[X(C14H13NO2)]
method: RPBEPBE
basis: SDD
operation: Freq
keyword: #p
keyword: freq=noraman
keyword: PBEPBE/SDD
title: #p freq=noraman PBEPBE/SDD
converged: YES YES NO NO
title: Mulliken charges:
elementType: O O N C C C C C C C C C C C C C C H H H H H H H H H H H H H
charge: -0.437443 -0.324269 -0.507221 0.315481 0.437091 0.051662 0.443195 -0.434247 -0.379898 -0.370352 -0.366465 -0.391163 -0.299988 -0.218764 -0.259917 -0.808074 0.144729 0.366821 0.242639 0.264407 0.269220 0.230333 0.229493 0.273558 0.227840 0.232899 0.224702 0.224357 0.234882 0.384493
chargesum: 0.00000
title: Mulliken charges with hydrogens summed into heavy atoms:
elementType: O O N C C C C C C C C C C C C C C
charge: -0.052950 -0.324269 -0.140400 0.315481 0.437091 0.051662 0.443195 -0.191608 -0.115491 -0.101133 -0.136132 -0.161670 -0.026430 0.009075 -0.027018 -0.124133 0.144729
polarizability: 2.93111202e+02 7.37656111e+00 1.80251439e+02 4.38154532e+00 8.52635042e+00 8.27785433e+01
1716.lowfreq: -6.5707 -2.1173 -0.0007 -0.0004 0.0003 7.7110 39.7678 41.4334 48.6672
frequency: 39.7088 41.3446 48.5817 75.3780 98.0475 145.9872 153.8722 198.1383 225.9436 284.1813 288.5667 331.8018 372.0972 408.2887 411.2107 425.6789 481.1290 504.6313 520.1196 542.9312 571.6681 593.0821 619.1987 643.0297 680.6296 709.4585 739.2897 742.6685 763.7950 773.7397 802.5388 809.6052 833.9162 841.3508 872.0254 885.2842 947.4449 963.7090 974.3676 988.3668 991.4196 1007.8506 1008.1955 1042.4467 1046.2844 1111.6881 1128.2146 1165.1106 1177.5914 1192.6655 1224.9866 1227.9827 1258.8416 1313.3420 1320.8269 1344.4351 1363.7666 1393.9916 1398.8937 1415.9019 1443.8728 1457.1335 1473.8973 1474.5127 1506.9495 1523.1228 1575.4120 1581.0072 1613.3890 1629.1799 1640.8805 2972.4476 3052.9717 3082.9585 3118.9724 3121.3426 3132.3896 3143.1130 3156.4572 3160.4105 3175.8913 3182.1717 3269.3788 3533.8640
redmass: 3.2853 3.3757 1.2293 4.3979 7.1617 4.7341 4.8894 5.6416 4.6313 4.3794 6.3339 3.4222 4.4095 3.9015 3.8798 3.2362 6.8445 2.7505 3.0105 6.0503 1.1926 4.6579 6.0053 6.5412 4.2516 3.3858 3.0126 4.0943 2.3070 1.9287 1.3848 3.3138 1.3819 1.7131 1.4054 4.6475 1.3114 1.3699 1.3506 1.3826 1.3337 3.8888 3.5544 2.1848 1.5426 1.8606 1.3085 1.6265 1.1117 1.1295 2.2906 2.6600 1.7975 1.3751 2.1110 2.4588 4.9678 7.9200 1.2224 3.4398 2.8156 2.1425 1.1730 1.0559 2.6254 3.5329 5.9613 6.6333 3.5049 5.3362 3.0775 1.0389 1.0946 1.0996 1.0877 1.0890 1.0873 1.0967 1.0905 1.0948 1.0935 1.0984 1.0796 1.0641
irintensity: 0.4832 1.1448 0.6342 0.2463 0.1408 0.5943 1.2253 1.1408 5.4879 2.3312 2.6997 2.1417 2.1342 5.6974 3.1720 9.9984 20.6922 16.8332 22.9701 0.1767 115.7086 32.6594 17.1011 0.6277 41.5344 4.5207 7.9748 0.8077 66.7285 35.5099 47.0316 22.4966 16.8859 74.9710 1.3884 4.7045 3.2192 0.4920 1.4137 0.7565 1.7992 137.7516 168.2041 24.6301 19.1584 182.1511 19.7652 158.0065 1.9159 0.5879 7.2704 10.1839 5.5025 7.0942 64.6461 198.9172 7.8393 0.9043 5.5438 4.6744 68.2314 147.7589 32.3616 13.0694 27.5073 395.7636 37.3173 178.0505 290.1573 1.5861 171.9362 53.1042 24.7690 18.3147 12.3421 32.0967 9.9108 17.6132 15.0053 3.0402 5.8309 12.2156 173.5541 68.1088
temp: 298.150 k
press: 1.00000 atm
elementType: 8 8 7 6 6 6 6 6 6 6 6 6 6 6 6 6 6 1 1 1 1 1 1 1 1 1 1 1 1 1
symmnumber: 1
zpe: 619121.1 jmol-1
zpe.correction: 0.235811 hartree
zpe.thermalcorrener: 0.250652 hartree
zpe.thermalcorrenthalpy: 0.251596 hartree
zpe.thermalcorrgfe: 0.192632 hartree
zpe.sumelectzpe: -745.321132 hartree
zpe.sumelectthermal: -745.306290 hartree
zpe.sumelectthermalent: -745.305346 hartree
zpe.sumelectthermalfe: -745.364311 hartree
dipole: -0.7428 0.9610 -0.1011
dipole: 1.2188
quadrupole: -83.6276 -90.4595 -102.8467
quadrupole: -2.3231 0.9549 2.1519
quadrupole: 8.6837 1.8518 -10.5354 -2.3231 0.9549 2.1519
hfenergy: -745.5569425 hartree
pointgroup: C01 [X(C14H13N1O2)]
dipole: 0.2769456 0.3914043 -0.0065809 debye
polarizability: 293.5949229|-2.5155575|176.7829267|3.0297074|-18.8827949|85.7633347 unknown
InChI: InChI=1S/C14H13NO2/c1-10-6-8-11(9-7-10)15-13-5-3-2-4-12(13)14(16)17/h2-9,15-16H,1H3
charge 0 multiplicity 1
30 atoms
O  -4.046892 -2.062836 -0.097853
O  -1.814487 -2.577153 0.206637
N  -0.059688 -0.56126 0.198672
C  -1.142882 0.306383 0.122021
C  1.328859 -0.275781 0.094023
C  -2.487281 -0.231628 0.039559
C  4.168358 0.101767 -0.125414
C  2.232948 -1.112613 0.803158
C  1.862173 0.738697 -0.746386
C  -0.99772 1.729674 0.167077
C  3.62467 -0.927503 0.686435
C  3.257672 0.920193 -0.841352
C  -3.60168 0.652909 -0.040863
C  -2.116658 2.571514 0.096807
C  -3.431291 2.043435 -0.024678
C  5.667751 0.326176 -0.213763
C  -2.708198 -1.680329 0.0592
H  -0.332245 -1.555381 0.310707
H  1.835254 -1.906193 1.44669
H  1.195679 1.350385 -1.361518
H  -0.003636 2.162776 0.298525
H  4.30031 -1.589272 1.242019
H  3.646619 1.704433 -1.502612
H  -4.600025 0.212214 -0.109119
H  -1.968329 3.656445 0.148161
H  -4.295641 2.711256 -0.086944
H  6.227323 -0.6164 -0.078945
H  5.955976 0.756467 -1.189343
H  6.015006 1.028401 0.569487
H  -4.090043 -3.055678 -0.061985
