program: Gaussian 09
title: 000152139
version: EM64L-G09RevD.01
frameworkgroup: C1[X(C21H28O6)]
method: RPBEPBE
basis: SDD
operation: Freq
keyword: #pfreq=noraman
keyword: PBEPBE/SDD
title: #p freq=noraman PBEPBE/SDD
converged: YES YES NO NO
title: Mulliken charges:
elementType: O O O O O O C C C C C C C C C C C C C C C C C C C C C H H H H H H H H H H H H H H H H H H H H H H H H H H H H
charge: -0.437669 -0.466861 -0.434046 -0.243278 -0.443749 -0.250156 0.350985 -0.113459 -0.148097 -0.151737 0.141980 -0.632246 -0.126810 -0.553936 0.101357 -0.520786 -0.512413 -0.828817 -0.259202 0.433685 0.040198 -0.797302 -0.160283 -0.603110 -0.346988 -0.413303 0.171832 0.262350 0.222347 0.253325 0.213968 0.241907 0.224477 0.231086 0.236110 0.228334 0.252003 0.246967 0.247399 0.257619 0.218511 0.232508 0.207727 0.213536 0.250089 0.247246 0.302416 0.348159 0.346420 0.273496 0.259423 0.223531 0.251100 0.347545 0.364612
chargesum: 0.00000
title: Mulliken charges with hydrogens summed into heavy atoms:
elementType: O O O O O O C C C C C C C C C C C C C C C C C C C C C
charge: -0.089509 -0.120442 -0.086501 -0.243278 -0.079138 -0.250156 0.350985 0.148891 0.074250 0.101588 0.141980 -0.176372 0.097666 -0.086740 0.101357 -0.040448 -0.018047 -0.120179 -0.051475 0.433685 0.040198 -0.086431 0.142133 -0.329614 0.135965 -0.162203 0.171832
polarizability: 3.16037104e+02 -3.84973254e+00 2.23072493e+02 -2.84075921e+01 -1.40386218e+00 1.85070358e+02
1716.lowfreq: -2.8358 -0.0008 -0.0007 -0.0004 6.6876 12.2637 21.0289 33.3691 37.9587
frequency: 20.4141 32.9185 37.7263 56.6115 71.1501 84.0132 102.1405 112.7982 152.0268 160.8502 166.6276 170.3797 186.3319 199.1107 209.4017 224.7155 232.7203 247.7641 255.1851 264.1588 273.0228 282.8224 302.8155 311.5158 313.6857 329.3146 335.1484 351.4894 365.4425 374.1759 381.4493 385.9638 397.7268 401.8084 412.9290 433.8521 442.2445 462.5111 483.5710 499.0458 513.7181 526.0098 550.1963 573.3593 591.4396 593.6433 633.0213 664.5406 694.4431 703.8942 708.4789 740.5707 761.4597 786.6392 816.6225 824.6245 855.3301 876.1803 890.0695 902.4993 909.1966 923.3238 933.5831 934.5627 949.9145 959.3695 971.8403 983.5017 985.2743 1001.0847 1006.3517 1010.9882 1021.3993 1026.0502 1027.5610 1036.1451 1042.2403 1058.1254 1064.6151 1098.4170 1103.3383 1108.6709 1121.0336 1131.8120 1141.2873 1153.7296 1161.3234 1174.1049 1183.4026 1188.9829 1202.6431 1226.9470 1228.6944 1237.4892 1239.5337 1249.8027 1253.3069 1265.4168 1270.9394 1277.2198 1286.6004 1292.7492 1297.1339 1300.8792 1305.1096 1314.8436 1321.1510 1328.4322 1336.6121 1342.2525 1346.4493 1369.8768 1375.3306 1377.0093 1380.3873 1385.7680 1393.0881 1398.0875 1439.2665 1457.6520 1464.5155 1467.6551 1476.0777 1478.9995 1482.8905 1483.7758 1492.2095 1557.1341 1587.0551 1611.1708 1661.6373 2917.9884 2948.3372 2956.3927 2957.1281 2963.0378 2966.4608 2983.3884 2987.8591 2996.1349 2997.1729 3000.7579 3012.8471 3020.8737 3030.9199 3065.3284 3066.9425 3083.1641 3084.0087 3089.5156 3090.8496 3097.2373 3137.6993 3139.5137 3166.1088 3429.9199 3529.5988 3547.4238 3549.0474
redmass: 5.8597 6.7090 4.6592 5.4630 5.4846 3.4027 1.8387 3.7304 6.0694 3.0732 2.8053 3.6129 2.1318 3.5689 4.3962 2.6797 3.3575 3.7697 4.1926 1.2768 3.3236 4.0340 3.7204 1.1712 3.8661 2.7806 1.1579 2.8722 3.5011 5.6355 3.4966 1.4122 4.1889 4.2387 1.8514 1.5007 2.3496 2.7726 3.2689 3.8524 3.9300 4.4677 3.6793 2.8595 2.9292 3.2547 4.2273 3.6463 3.0460 3.8064 3.8368 3.7503 3.9734 1.9577 2.6224 1.6065 2.2795 2.7478 2.4134 2.5477 2.2151 2.1019 2.4797 1.9830 2.2204 2.4455 2.6725 3.3503 2.4659 1.3278 2.5370 2.5052 2.4497 2.6309 2.9366 3.0797 2.3744 2.3400 2.8861 2.2153 2.3967 1.8143 1.9383 2.2010 1.6200 2.0036 1.9267 1.5092 1.1320 1.7999 1.8914 1.5497 1.3505 1.4331 1.3619 1.4880 1.4501 1.4558 1.4835 1.4211 1.4799 2.0585 1.5992 1.3885 1.5302 1.5246 1.3554 1.3746 1.5506 1.4857 1.3476 1.4429 1.4554 1.3722 1.6750 1.3414 1.1987 1.5124 1.0776 1.0747 1.0836 1.0889 1.0551 1.0733 1.0586 1.0561 1.0726 8.8759 8.2867 8.5625 7.2831 1.0814 1.0791 1.0634 1.0793 1.0836 1.0606 1.0816 1.0362 1.0535 1.0484 1.0599 1.0947 1.0625 1.1019 1.1023 1.1001 1.0981 1.0993 1.1022 1.1004 1.0992 1.0878 1.0903 1.0974 1.0642 1.0656 1.0658 1.0659
irintensity: 0.7321 1.5945 1.3120 2.2120 2.1581 7.7092 1.5768 0.5169 2.2924 0.7828 1.2824 2.9354 1.7992 0.7375 2.3916 4.1744 10.4464 0.7798 2.8682 0.8062 1.4309 4.6452 4.2909 137.6628 17.0212 15.5939 143.5806 4.5963 33.1868 19.5523 15.9749 65.6582 10.8079 20.1561 52.4108 147.4490 15.7360 3.2825 5.9905 3.7508 16.5942 2.0882 4.5401 9.6639 4.1432 6.1799 3.2583 1.7339 12.0625 10.8687 1.9001 3.3165 1.3012 4.1715 3.4945 30.4614 6.9032 10.5705 74.2601 36.0520 57.7163 32.1914 26.6229 24.6120 8.7496 10.8836 13.1311 28.7715 8.1688 3.8880 58.7118 4.7360 32.9950 20.6251 107.8685 5.3117 6.6045 4.0876 15.1553 4.0066 9.8909 0.7993 4.9481 11.7753 1.6467 7.2514 21.4582 13.8848 2.5134 4.3329 14.0313 3.7705 6.0267 2.4577 52.3430 73.1145 28.9230 22.7537 57.1311 16.5625 8.8769 30.3168 30.0435 7.1196 10.8315 5.4352 4.4215 0.8594 4.7950 5.7642 7.5881 8.9319 0.0801 85.6831 13.4316 5.0251 34.0531 10.0893 6.7370 12.1343 0.8746 5.4628 3.3577 19.3064 17.7524 1.7781 5.5976 186.5413 56.6681 11.3967 149.2251 32.4019 2.6105 44.2957 12.0909 4.2347 23.7088 24.0766 34.7311 11.6980 28.5846 40.8016 8.7327 31.4672 29.1421 24.9693 11.7526 45.9986 23.3265 22.7704 18.6721 14.8362 7.0452 0.4314 15.8750 22.0514 8.3017 6.5722 5.5923
temp: 298.150 k
press: 1.00000 atm
elementType: 8 8 8 8 8 8 6 6 6 6 6 6 6 6 6 6 6 6 6 6 6 6 6 6 6 6 6 1 1 1 1 1 1 1 1 1 1 1 1 1 1 1 1 1 1 1 1 1 1 1 1 1 1 1 1
symmnumber: 1
zpe: 1191630.1 jmol-1
zpe.correction: 0.453868 hartree
zpe.thermalcorrener: 0.480262 hartree
zpe.thermalcorrenthalpy: 0.481207 hartree
zpe.thermalcorrgfe: 0.398963 hartree
zpe.sumelectzpe: -1266.261004 hartree
zpe.sumelectthermal: -1266.234609 hartree
zpe.sumelectthermalent: -1266.233665 hartree
zpe.sumelectthermalfe: -1266.315909 hartree
dipole: -3.8658 0.3842 4.7959
dipole: 6.1720
quadrupole: -227.8650 -156.4376 -163.0716
quadrupole: -0.7311 18.5610 2.0852
quadrupole: -45.4070 26.0205 19.3865 -0.7311 18.5610 2.0852
hfenergy: -1266.7148717 hartree
pointgroup: C01 [X(C21H28O6)]
dipole: -1.5120875 0.1610165 1.8931401 debye
polarizability: 315.8008609|-2.8455964|222.8869659|-29.1026027|-2.5651646|185.4921286 unknown
InChI: InChI=1S/C21H28O6/c1-19-5-3-11(23)7-14(19)15(24)8-12-13-4-6-21(27,17(26)10-22)20(13,2)9-16(25)18(12)19/h3,5,7,12-13,15-16,18,22,24-25,27H,4,6,8-10H2,1-2H3
charge 0 multiplicity 1
55 atoms
O  -3.195537 -0.004721 -1.914035
O  0.587445 -2.90081 0.26667
O  3.370484 3.215118 0.266101
O  -4.614054 -1.565462 0.473875
O  -7.056107 -0.68591 -0.202014
O  6.076774 -0.51949 -1.763054
C  -2.020859 -0.087447 0.341581
C  -1.048914 1.01952 -0.172196
C  0.350094 0.938134 0.473002
C  0.995587 -0.455811 0.118426
C  -3.313225 0.306965 -0.453689
C  -1.385824 -1.457911 0.023697
C  0.040561 -1.575043 0.627596
C  -1.878739 2.319702 -0.045552
C  2.512778 -0.570868 0.626123
C  -3.339988 1.865917 -0.382983
C  1.230787 2.125811 0.031842
C  -2.331941 0.02728 1.862644
C  2.627219 2.018442 0.664686
C  3.25475 0.708288 0.212978
C  -4.611633 -0.417221 -0.061509
C  2.562942 -0.7364 2.186776
C  3.180784 -1.809843 0.041452
C  4.379157 0.700299 -0.564507
C  -5.948855 0.210482 -0.451428
C  4.319428 -1.798698 -0.708782
C  5.008046 -0.541393 -1.065122
H  -0.914496 0.83315 -1.259974
H  0.241262 1.006442 1.576972
H  1.034628 -0.534457 -0.989064
H  -1.277229 -1.603064 -1.070992
H  -2.016863 -2.279103 0.418539
H  -0.030037 -1.515365 1.734454
H  -1.531653 3.109604 -0.732278
H  -1.821492 2.726658 0.981662
H  -4.055184 2.226432 0.376747
H  -3.67238 2.249245 -1.362581
H  0.772762 3.081084 0.344612
H  1.343324 2.149763 -1.069381
H  -2.912349 -0.849376 2.196059
H  -1.411556 0.075737 2.467719
H  -2.920425 0.930978 2.101319
H  2.514976 2.00821 1.773264
H  1.97147 0.038837 2.705914
H  2.170774 -1.725654 2.478987
H  3.606444 -0.669151 2.540014
H  2.681028 -2.753783 0.276388
H  -3.040617 -0.980151 -2.02391
H  -0.104206 -3.585084 0.456911
H  4.853867 1.638338 -0.8747
H  -5.913254 0.484608 -1.52444
H  -6.085331 1.148545 0.127752
H  4.766783 -2.727997 -1.080155
H  4.279165 3.185711 0.662024
H  -6.678571 -1.501186 0.235459
