program: Gaussian 09
title: 000152132
version: EM64L-G09RevD.01
frameworkgroup: C1[X(C15H12O)]
method: RPBEPBE
basis: SDD
operation: Freq
keyword: #pfreq=noraman
keyword: PBEPBE/SDD
title: #p freq=noraman PBEPBE/SDD
converged: YES YES NO NO
title: Mulliken charges:
elementType: O C C C C C C C C C C C C C C C H H H H H H H H H H H H
charge: -0.259798 -0.022544 -0.022545 0.270625 0.270623 -0.812745 0.351754 0.351759 -0.577741 -0.577742 -0.442865 -0.442866 -0.208641 -0.208641 -0.227725 -0.227724 0.236863 0.227524 0.242018 0.243127 0.243127 0.242018 0.232518 0.232519 0.220884 0.220885 0.222668 0.222667
chargesum: 0.00000
title: Mulliken charges with hydrogens summed into heavy atoms:
elementType: O C C C C C C C C C C C C C C C
charge: -0.259798 -0.022544 -0.022545 0.270625 0.270623 -0.348358 0.351754 0.351759 -0.092596 -0.092598 -0.210346 -0.210347 0.012243 0.012243 -0.005058 -0.005056
polarizability: 2.92421209e+02 4.35050889e-05 1.74762322e+02 -4.55181408e-05 1.50398143e+00 8.48832856e+01
1716.lowfreq: -5.3287 -0.0003 0.0003 0.0006 1.5408 2.5009 56.5294 58.6262 86.9658
frequency: 56.5084 58.6175 86.9540 166.5634 169.4184 212.9021 242.0738 262.2478 307.0018 332.4896 347.9566 375.2984 427.2380 434.0359 481.8639 492.6735 518.8760 525.2176 546.9197 603.7332 631.9077 653.0546 663.5113 710.7177 712.3978 760.9415 775.3858 854.7307 861.4888 868.4693 914.7850 928.5232 933.8116 935.3297 946.0697 948.9193 974.4048 974.4175 1017.1368 1051.0310 1079.9491 1116.7720 1165.0541 1165.8451 1175.8768 1184.0594 1205.3531 1207.9510 1241.9783 1248.0913 1295.9292 1321.4772 1338.5690 1359.0248 1369.6415 1393.0847 1401.4290 1441.9442 1442.4434 1443.3968 1575.5996 1576.7909 1623.8617 1642.7015 1643.2235 1911.6225 2923.3711 2923.5680 2948.2532 2992.0950 2992.1268 3046.8551 3116.7602 3117.0563 3128.8408 3129.4744 3152.3758 3152.8209
redmass: 4.5066 2.8586 2.8132 3.1186 4.3094 3.7800 4.7478 4.4974 2.8977 6.0479 7.9803 2.9788 4.3251 5.9102 3.3914 3.7603 6.8566 2.7259 5.6312 3.4044 5.5606 7.2944 4.6929 1.2790 1.2604 4.9561 4.0472 4.3610 1.7350 1.5796 2.1686 2.3020 2.9208 1.9025 3.9892 2.5120 1.3081 1.3150 2.6824 2.1307 4.9759 3.2083 1.1881 1.2933 1.2225 1.1024 1.1483 2.0993 1.8846 1.9608 1.4983 1.5760 2.1286 2.0491 1.4968 1.8737 1.8066 1.0924 1.0915 1.0867 8.2557 7.5092 10.6686 5.7793 5.9115 11.9219 1.0696 1.0696 1.0660 1.0880 1.0880 1.0927 1.0851 1.0850 1.0907 1.0909 1.1002 1.1002
irintensity: 0.6979 0.1351 3.8362 3.5583 0.0869 0.2186 6.3523 4.5996 1.5531 2.1490 32.5874 6.3474 16.4747 7.0786 1.1311 3.3170 7.8131 17.5467 3.6491 14.5561 1.5913 2.2285 1.9250 16.2119 111.2703 29.7544 15.0344 48.1203 12.9179 3.5201 8.0042 5.4256 29.7460 12.5116 45.7287 14.1268 0.7999 0.1299 0.3156 0.8221 4.4319 0.3530 2.3735 10.8755 1.7569 3.7265 2.4655 9.6921 14.8059 10.6995 6.5067 3.0737 6.3055 3.9493 0.7566 0.7300 0.2493 32.0186 4.2088 10.5493 5.4684 2.5448 21.0202 1.3873 20.5925 6.2496 27.3612 27.0455 17.3664 1.7245 23.9986 13.6492 11.0105 1.7138 21.8700 21.2901 79.6331 25.9737
temp: 298.150 k
press: 1.00000 atm
elementType: 8 6 6 6 6 6 6 6 6 6 6 6 6 6 6 6 1 1 1 1 1 1 1 1 1 1 1 1
symmnumber: 1
zpe: 573973.6 jmol-1
zpe.correction: 0.218615 hartree
zpe.thermalcorrener: 0.231563 hartree
zpe.thermalcorrenthalpy: 0.232507 hartree
zpe.thermalcorrgfe: 0.179300 hartree
zpe.sumelectzpe: -652.754290 hartree
zpe.sumelectthermal: -652.741342 hartree
zpe.sumelectthermalent: -652.740398 hartree
zpe.sumelectthermalfe: -652.793606 hartree
dipole: 0.0000 -1.6876 0.2269
dipole: 1.7028
quadrupole: -77.6356 -92.1735 -95.7995
quadrupole: 0.0000 -0.0001 -0.6491
quadrupole: 10.9006 -3.6373 -7.2633 0.0000 -0.0001 -0.6491
hfenergy: -652.9729053 hartree
pointgroup: C01 [X(C15H12O1)]
dipole: 0.0001777 -0.6326397 -0.2203797 debye
polarizability: 292.4212006|0.0258209|171.7495509|0.0190925|16.2471755|87.8960643 unknown
InChI: InChI=1S/C15H12O/c1-3-7-12-10(5-1)9-11-6-2-4-8-13(11)15-14(12)16-15/h1-6H,7-9H2
charge 0 multiplicity 1
28 atoms
O  -0.000791 2.736927 0.704761
C  0.689615 1.483698 0.197836
C  -0.690505 1.483376 0.197679
C  1.759551 0.658932 0.115706
C  -1.760047 0.658124 0.115304
C  0.000246 -0.912891 -1.060287
C  1.359466 -0.690118 -0.358576
C  -1.359237 -0.690741 -0.358893
C  3.199695 0.979738 0.485732
C  -3.20042 0.978271 0.485005
C  2.270363 -1.719083 -0.236678
C  -2.269688 -1.720125 -0.237195
C  4.056167 -0.26006 0.665788
C  -4.056354 -0.261923 0.664894
C  3.607851 -1.506194 0.32533
C  -3.607391 -1.50785 0.324531
H  0.000202 -0.255685 -1.957304
H  0.000529 -1.952201 -1.43498
H  3.225183 1.598354 1.405204
H  3.662664 1.618991 -0.299833
H  -3.663514 1.617292 -0.300676
H  -3.2264 1.596895 1.404459
H  1.99451 -2.729214 -0.562586
H  -1.9933 -2.730128 -0.563047
H  5.071106 -0.116878 1.056175
H  -5.071438 -0.11921 1.055074
H  4.262321 -2.37647 0.452504
H  -4.261486 -2.378427 0.451575
