program: Gaussian 09
title: 000152111
version: EM64L-G09RevD.01
frameworkgroup: C1[X(C8H10O5)]
method: RPBEPBE
basis: SDD
operation: Freq
keyword: #pfreq=noraman
keyword: PBEPBE/SDD
title: #p freq=noraman PBEPBE/SDD
converged: YES YES NO NO
title: Mulliken charges:
elementType: O O O O O C C C C C C C C H H H H H H H H H H
charge: -0.221122 -0.229602 -0.237536 -0.191049 -0.174649 0.262014 -0.676443 -0.665437 -0.036709 0.196131 0.194337 -0.147671 -0.502051 0.252981 0.225579 0.226977 0.234562 0.243016 0.241506 0.263371 0.228753 0.262877 0.250165
chargesum: 0.00000
title: Mulliken charges with hydrogens summed into heavy atoms:
elementType: O O O O O C C C C C C C C
charge: -0.221122 -0.229602 -0.237536 -0.191049 -0.174649 0.262014 0.029094 0.053648 -0.036709 0.196131 0.194337 0.115700 0.239744
polarizability: 1.57416449e+02 1.55087295e-01 1.01772450e+02 -1.20703207e+00 5.01213775e-01 6.72152779e+01
1716.lowfreq: -1.8594 -0.0004 -0.0003 0.0002 4.6122 8.5449 20.4335 42.9915 90.8477
frequency: 19.8955 42.9415 90.8431 119.4828 125.1354 126.4777 177.4017 223.0307 229.9171 270.3712 275.6121 319.8178 341.1227 352.7963 361.3484 410.2999 466.5398 476.0315 514.5779 570.0533 601.3230 660.3829 729.5109 750.5103 821.8050 842.6599 881.9952 932.5156 946.1829 951.8518 954.1148 998.7071 1080.7027 1110.6875 1123.2289 1153.1860 1192.0978 1220.7787 1261.7226 1271.6624 1362.3008 1383.6634 1399.9269 1433.2338 1451.4052 1454.5744 1454.7849 1468.9454 1471.1499 1475.3460 1600.5140 1638.4019 1673.6753 2992.7898 3002.8486 3015.1540 3079.0492 3100.7621 3103.5377 3113.0279 3121.7737 3127.4720 3152.8068
redmass: 1.0846 4.3727 5.2876 3.7833 5.3565 4.2435 1.0236 5.7983 1.0969 2.8766 4.0386 3.7262 5.3009 3.8063 3.6617 5.0573 8.5041 5.6382 5.0852 5.0211 5.2060 12.1666 6.2056 8.3779 7.2165 6.5243 8.6882 1.4717 3.1923 1.9257 2.3771 1.3118 4.8040 1.2930 1.7575 1.9654 2.4637 3.8403 4.0079 4.4555 1.5187 1.2657 1.2269 1.2105 1.0514 1.0462 1.0571 1.0603 1.0506 1.0470 7.4927 11.7613 9.9241 1.0312 1.0355 1.0356 1.0914 1.1053 1.0999 1.1009 1.1004 1.1009 1.1030
irintensity: 1.5465 8.4881 0.6045 4.3536 1.8065 2.4050 0.0033 17.7004 0.1803 1.1393 6.7289 9.8619 0.5307 0.7164 0.4632 2.5022 3.5461 6.2155 0.2074 1.6059 5.9459 10.9575 21.0572 26.1450 66.7882 23.8419 25.0246 0.0147 12.8419 21.1011 6.2229 1.1126 698.9482 5.7953 6.0323 203.6873 119.7712 200.8774 113.5777 8.2915 55.8764 40.6235 32.8465 23.8591 4.6628 0.6093 18.5197 0.4776 22.5870 11.2430 331.3179 446.3580 237.6256 53.3569 5.8965 7.7802 0.6257 25.2362 23.2157 1.6178 19.8541 15.2489 8.7646
temp: 298.150 k
press: 1.00000 atm
elementType: 8 8 8 8 8 6 6 6 6 6 6 6 6 1 1 1 1 1 1 1 1 1 1
symmnumber: 1
zpe: 449057.0 jmol-1
zpe.correction: 0.171037 hartree
zpe.thermalcorrener: 0.184772 hartree
zpe.thermalcorrenthalpy: 0.185716 hartree
zpe.thermalcorrgfe: 0.129668 hartree
zpe.sumelectzpe: -685.956796 hartree
zpe.sumelectthermal: -685.943061 hartree
zpe.sumelectthermalent: -685.942117 hartree
zpe.sumelectthermalfe: -685.998165 hartree
dipole: -2.6899 0.8448 2.8185
dipole: 3.9866
quadrupole: -44.4382 -97.0613 -73.2975
quadrupole: -7.4511 0.4638 -0.4409
quadrupole: 27.1608 -25.4623 -1.6985 -7.4511 0.4638 -0.4409
hfenergy: -686.1278327 hartree
pointgroup: C01 [X(C8H10O5)]
dipole: -1.0544956 0.3277245 1.1138627 debye
dipolederiv: -1.4459662 0.5971387 -0.1587145 0.2971169 -0.7720383 0.0492351 -0.0213463 0.0503981 -0.4041496 -1.6277001 -0.3286655 -0.2330587 -0.017076 -0.5555002 -0.0129557 -0.0651891 -0.0597588 -0.4286521 -0.5973831 0.1924445 -0.0495738 0.0163351 -1.1681354 0.0913583 -0.0356732 0.039605 -0.3369008 -0.6712051 -0.2529053 -0.1098815 -0.1762656 -0.9199407 -0.1518715 -0.0974865 -0.120415 -0.3436613 -1.7974719 -0.0455347 0.1353814 -0.9879632 -0.2508675 0.0910593 0.242369 0.0043017 -0.2582997 1.1885908 -0.0446683 0.1485478 -0.0768702 0.9571203 -0.0197233 0.2861951 -0.0339174 0.8214621 -0.1928207 0.0297452 0.0436557 0.0298689 0.0130353 -0.0006162 0.0590079 -0.004416 -0.0599376 -0.0728892 0.0034819 0.0621843 0.0132477 -0.0502953 0.0067322 -0.0579642 0.0209912 -0.2670819 -1.4165248 -0.0288816 0.0753145 0.1529391 -0.6098536 -0.0461584 0.0721132 -0.0217013 -0.1369041 1.8165794 -0.3612142 0.135957 0.3452701 1.4537187 -0.1336528 -0.0179643 -0.0142383 0.2627453 1.8296249 0.2627447 0.2350946 -0.3870467 1.2765771 0.2015119 0.0027236 0.1433651 0.3286404 1.8144877 0.0528145 -0.1853981 0.7852269 0.2389314 -0.0647077 -0.1951548 -0.0035223 0.0892993 1.0229756 -0.040378 -0.0397622 -0.153981 0.2179877 0.0355832 -0.1200045 0.0167956 0.3006194 0.1079583 0.0029286 -0.0116154 -0.0008625 0.1162439 0.0164627 0.0064611 0.0133707 -0.0950637 -0.0000389 -0.0628793 -0.0336323 -0.1119378 0.0055677 -0.0642759 -0.0504562 -0.0749379 0.0687727 0.0539863 0.0450616 -0.0068512 0.0953461 -0.0611526 0.0558209 -0.0139949 0.069831 0.0881327 -0.1078932 0.0250818 0.0788614 0.0252989 0.089944 -0.0111375 0.0701646 -0.0073308 0.0568201 0.0784892 0.0644359 -0.0307026 0.0880514 -0.0564026 0.0616344 -0.034499 0.0415155 0.0709527 0.02401 -0.083736 -0.0599231 -0.1063801 0.0082098 -0.0619852 -0.0588352 -0.0399343 0.0550961 0.0941553 0.0350815 0.0127705 0.0278178 0.0040413 -0.0145389 0.021772 -0.020648 0.1564064 -0.0321165 -0.0346902 -0.0262486 0.1046454 -0.0300244 -0.1313277 0.0408678 -0.1051791 0.0043509 -0.003041 -0.0418206 0.0300907 -0.089904 0.0041222 0.0595977 0.0529691 0.046826 0.1032274 -0.0658067 0.0144148 -0.0124959 0.1271228 0.0887113 0.043955 -0.0860754 0.0589993 -0.0758747 unknown
polarizability: 157.3775447|-1.6782267|101.741532|-0.6096121|1.7658118|67.2851 unknown
InChI: InChI=1S/C8H10O5/c1-8(2)12-6(9)5(4-11-3)7(10)13-8/h4H,1-3H3
charge 0 multiplicity 1
23 atoms
O  1.69393 1.096807 -0.328788
O  1.312715 -1.315666 -0.492822
O  -0.058663 2.57368 -0.340723
O  -0.80284 -2.188208 -0.662406
O  -2.91489 -0.417519 0.07381
C  2.154631 -0.255341 0.114061
C  3.544942 -0.431108 -0.477727
C  2.089663 -0.342162 1.645212
C  -0.595028 0.201766 -0.218075
C  0.31635 1.381528 -0.282686
C  -0.105767 -1.18016 -0.445481
C  -1.929251 0.508908 -0.022973
C  -4.30225 0.091421 0.216156
H  3.495875 -0.349106 -1.574789
H  4.220227 0.348364 -0.088522
H  3.940345 -1.424536 -0.209903
H  1.057861 -0.21005 2.014225
H  2.453518 -1.33017 1.972646
H  2.725238 0.442056 2.088868
H  -2.202822 1.573013 0.068665
H  -4.343322 0.926711 0.938358
H  -4.884367 -0.763708 0.58496
H  -4.675293 0.41148 -0.771367
