program: Gaussian 09
title: 000152093
version: EM64L-G09RevD.01
frameworkgroup: C1[X(C6H14N2O)]
method: RPBEPBE
basis: SDD
operation: Freq
keyword: #p
keyword: freq=noraman
keyword: PBEPBE/SDD
title: #p freq=noraman PBEPBE/SDD
converged: YES YES NO NO
title: Mulliken charges:
elementType: O N N C C C C C C H H H H H H H H H H H H H H
charge: -0.292465 -0.129386 -0.285917 -0.342620 -0.318949 -0.660614 0.246074 -0.677813 -0.731548 0.266335 0.207465 0.268870 0.194181 0.225754 0.191826 0.239180 0.224189 0.235430 0.204857 0.220553 0.242695 0.232315 0.239589
chargesum: 0.00000
title: Mulliken charges with hydrogens summed into heavy atoms:
elementType: O N N C C C C C C
charge: -0.292465 -0.129386 -0.017047 0.131179 0.100987 -0.005419 0.246074 -0.016973 -0.016949
polarizability: 9.86257263e+01 -2.82683754e+00 8.83212170e+01 -3.19308156e+00 -1.24380474e+00 6.64148621e+01
1716.lowfreq: -13.7924 0.0007 0.0008 0.0011 4.4737 18.5794 37.9042 47.5556 63.6826
frequency: 35.8543 47.0502 63.6462 84.2471 98.4831 132.8166 206.9191 236.4108 275.4952 297.6921 334.9637 382.1257 442.4429 494.9744 570.4269 575.3147 653.5337 746.9100 790.4871 814.5200 903.4451 916.5515 986.5815 1025.3247 1032.8084 1063.0327 1078.6773 1113.9654 1140.8603 1155.8805 1203.2236 1250.6416 1274.8336 1340.2113 1351.9635 1366.7760 1375.3973 1387.9124 1393.1547 1440.1708 1451.1650 1462.3470 1465.1444 1473.2871 1476.3830 1481.5039 1487.6629 1498.0530 1599.9380 2907.0370 2978.5469 2982.7861 2993.2846 3004.0823 3034.2349 3061.6951 3077.1384 3085.1337 3094.3640 3095.8541 3097.9342 3131.4264 3388.2951
redmass: 1.6304 1.5935 2.8820 1.8750 2.8828 2.5830 1.2073 1.2125 2.5557 2.0916 3.2234 2.9069 4.3699 2.4880 2.8843 3.5641 2.2251 2.0500 1.2486 1.1443 1.7235 2.3878 1.7742 1.8990 1.7668 3.0466 2.1333 1.7667 2.2154 2.2664 3.2992 1.2196 1.4186 1.3210 1.2905 1.8044 1.3317 1.2336 1.2556 1.0821 1.0564 1.0890 1.1491 1.0453 1.0723 1.0417 1.2205 1.0833 6.6961 1.0705 1.0368 1.0374 1.0660 1.0364 1.0901 1.0965 1.0978 1.0962 1.0963 1.1014 1.1006 1.1018 1.0747
irintensity: 0.8041 0.1690 0.6511 0.6218 4.4580 1.8923 0.9261 0.5552 2.7585 4.7166 6.9166 6.5103 9.4378 1.9878 9.3217 28.2586 46.5541 48.6813 7.4011 1.9724 3.9999 16.8492 5.2732 7.5069 9.8191 6.7257 4.9236 4.4508 5.9643 12.9538 43.1675 14.2791 92.1516 5.0914 1.0576 41.7445 71.5769 12.9755 30.6974 38.2026 18.3851 14.6795 26.0587 12.8114 10.4908 7.5471 14.2819 6.8999 225.4705 70.9042 27.7599 28.7907 46.1344 7.8584 12.3709 21.9479 50.4284 25.5235 12.5391 23.0859 38.7354 16.8836 2.1683
temp: 298.150 k
press: 1.00000 atm
elementType: 8 7 7 6 6 6 6 6 6 1 1 1 1 1 1 1 1 1 1 1 1 1 1
symmnumber: 1
zpe: 522846.0 jmol-1
zpe.correction: 0.199142 hartree
zpe.thermalcorrener: 0.211008 hartree
zpe.thermalcorrenthalpy: 0.211952 hartree
zpe.thermalcorrgfe: 0.160184 hartree
zpe.sumelectzpe: -420.990885 hartree
zpe.sumelectthermal: -420.979019 hartree
zpe.sumelectthermalent: -420.978075 hartree
zpe.sumelectthermalfe: -421.029842 hartree
dipole: -4.3451 1.8396 0.7579
dipole: 4.7790
quadrupole: -64.6464 -52.9075 -55.4806
quadrupole: 3.0611 3.0694 -0.4642
quadrupole: -6.9683 4.7707 2.1976 3.0611 3.0694 -0.4642
hfenergy: -421.1900269 hartree
pointgroup: C01 [X(C6H14N2O1)]
dipole: 1.5655358 1.0014957 -0.2850387 debye
dipolederiv: -1.098877 -0.3595912 0.1734578 -0.1065839 -0.6649366 -0.0455056 0.2775737 0.0690149 -0.4310132 -0.3851085 -0.2313453 -0.0754153 -0.2377286 -0.8600666 0.0577554 -0.1834426 0.009161 -0.3010031 -0.1369307 0.0797848 -0.0375992 -0.0283082 -0.403156 -0.2548275 -0.0734733 -0.3194205 -0.1851641 0.0310557 -0.2458751 0.0771459 -0.1364927 0.3794035 0.0067169 0.161642 0.080987 0.2385345 0.3356928 0.0389767 0.174675 -0.0568095 0.3095459 0.0839972 0.2435622 0.1389123 0.2884232 0.0825437 0.0701561 -0.0291878 0.0584976 -0.0723184 0.0436386 -0.0494194 0.0369296 -0.0272679 1.1870682 0.564485 -0.2797141 0.5676728 1.4069841 0.1457391 -0.2644838 0.0950097 0.2700256 -0.1213034 -0.0051669 0.0235705 -0.0128391 0.0786171 -0.0276322 -0.0066422 -0.0249365 0.0523705 -0.064686 0.2340545 0.1051022 0.1362247 -0.2387818 -0.12574 0.0903234 -0.1486397 -0.014767 -0.0156114 0.0518478 0.0728442 -0.0141664 0.1149544 0.0641383 0.0397211 0.0280826 0.0642692 0.0134013 -0.0366455 -0.1617693 -0.0191553 -0.0575883 -0.0552566 -0.1172019 -0.0616776 -0.0560972 0.0532659 -0.0662541 -0.0177879 -0.0810213 0.1129814 0.1979767 -0.0298156 0.1246562 0.132062 -0.0299731 0.0387902 0.0181796 -0.0125855 -0.1528251 -0.1693845 -0.0565881 -0.134511 -0.0710553 0.0365718 -0.0372018 0.0255887 -0.0105976 -0.0522344 0.1225348 -0.0134765 0.0866263 -0.0388455 -0.1079397 -0.0957948 0.1188463 -0.0465471 0.0755598 0.0334864 0.0781308 0.0659781 0.006706 0.0078395 -0.0363169 -0.1005472 -0.0738405 0.0610044 -0.0645159 -0.0996248 -0.0157849 -0.0307262 0.0498796 0.106485 0.0368019 0.0976819 -0.1162741 -0.0653458 0.0532048 -0.0796467 0.0509572 0.0957008 0.0060683 0.0152244 0.0616763 -0.0774019 -0.1053641 0.0634844 -0.0947628 0.0284883 0.0788076 0.0203023 -0.005733 -0.0188949 -0.0637643 0.140051 0.0534431 0.1285993 -0.0288228 -0.087606 -0.0267412 -0.0991917 -0.0278373 0.1051763 -0.016973 -0.1399908 -0.0185597 -0.0186171 0.0049522 -0.1408452 -0.009107 -0.079891 -0.0389036 -0.0227037 0.0157412 -0.0034353 0.1151151 -0.0302286 0.065737 -0.0921594 0.0355633 0.0794462 -0.0133829 -0.1140007 0.0254852 0.0210659 0.1014854 0.0050904 0.0667753 0.0059825 0.0745781 0.0705975 0.0713329 0.0119323 -0.0646381 unknown
polarizability: 97.3210834|4.4979869|89.3704133|-3.7842483|1.6694123|66.6703087 unknown
InChI: InChI=1S/C6H14N2O/c1-4-7-8(5-2)6(3)9/h7H,4-5H2,1-3H3
charge 0 multiplicity 1
23 atoms
O  -2.292212 -1.239969 0.469084
N  -0.400737 0.045736 0.062967
N  0.930695 0.096844 -0.44222
C  -1.038558 1.268455 0.613556
C  1.99119 0.302087 0.582855
C  -1.353107 2.319131 -0.471681
C  -1.107104 -1.165704 0.019147
C  3.368442 0.30649 -0.1015
C  -0.379454 -2.363306 -0.578865
H  -1.96838 0.930659 1.100348
H  -0.37895 1.701808 1.390445
H  1.00069 0.775239 -1.217041
H  1.857389 1.245603 1.161773
H  1.923111 -0.534214 1.302056
H  -0.439698 2.66679 -0.992125
H  -2.047744 1.905046 -1.22317
H  -1.828153 3.205676 -0.013775
H  3.530213 -0.637025 -0.65086
H  3.459918 1.143831 -0.81991
H  4.171174 0.42103 0.648031
H  -1.085686 -3.207073 -0.60329
H  0.501596 -2.637906 0.027687
H  -0.009734 -2.143227 -1.593811
