program: Gaussian 09
title: 000152076
version: EM64L-G09RevD.01
frameworkgroup: C1[X(C12H18N6)]
method: RPBEPBE
basis: SDD
operation: Freq
keyword: #pfreq=noraman
keyword: PBEPBE/SDD
title: #p freq=noraman PBEPBE/SDD
converged: NO YES NO NO
title: Mulliken charges:
elementType: N N N N N N C C C C C C C C C C C C H H H H H H H H H H H H H H H H H H
charge: -0.105443 -0.105387 -0.105324 -0.142483 -0.142478 -0.142319 -0.355322 -0.355335 -0.355354 -0.355415 -0.355549 -0.355410 -0.467573 -0.467432 -0.467397 0.040179 0.039973 0.040018 0.231357 0.232120 0.232177 0.231380 0.231405 0.232105 0.232111 0.231526 0.231497 0.232115 0.232175 0.231438 0.229549 0.229335 0.229568 0.229314 0.229573 0.229306
chargesum: 0.00000
title: Mulliken charges with hydrogens summed into heavy atoms:
elementType: N N N N N N C C C C C C C C C C C C
charge: -0.105443 -0.105387 -0.105324 -0.142483 -0.142478 -0.142319 0.108154 0.108221 0.108156 0.108223 0.108063 0.108204 -0.008689 -0.008551 -0.008518 0.040179 0.039973 0.040018
polarizability: 2.23322898e+02 -1.39967458e-03 2.23289319e+02 -1.11600423e-02 -1.80469111e-02 1.03589347e+02
1716.lowfreq: -4.5823 -3.2959 -2.2254 -0.0010 -0.0007 -0.0006 27.0858 27.2841 33.0642
frequency: 27.0018 27.0791 33.0021 76.0965 77.5224 93.5955 96.1775 102.6804 129.0801 130.7762 132.7231 166.3586 200.6506 200.9065 202.4514 308.4504 334.1762 334.2948 461.0364 461.3498 641.6488 692.7407 692.8953 743.6994 743.7739 756.0653 757.6887 758.2455 779.1796 830.4041 830.7298 831.0717 850.6152 878.2716 884.8792 885.5773 927.3764 927.6758 928.8979 934.7485 960.7724 960.9471 1091.1268 1097.8467 1098.9460 1099.6632 1111.9008 1112.3206 1113.5955 1116.1527 1116.3371 1157.2798 1157.4747 1158.5169 1165.5575 1186.4223 1186.9602 1187.5047 1196.5256 1196.8957 1242.4656 1243.8854 1244.4264 1251.0403 1271.4864 1272.2239 1276.5821 1295.4862 1295.7885 1297.2152 1437.6990 1437.9422 1464.1188 1464.5248 1465.4304 1481.3892 1482.6378 1483.1896 1498.6596 1499.0343 1502.0313 1535.1681 1535.6179 1634.0927 2991.9523 2992.9757 2993.0967 2998.7481 2998.8824 3000.4601 3049.8465 3049.9818 3050.4436 3051.8336 3052.1666 3052.2899 3052.4248 3052.6674 3052.9473 3123.6296 3123.7070 3124.0208
redmass: 3.6881 3.6089 3.5084 3.8843 3.8882 2.7761 2.7608 2.3266 1.7101 1.7314 1.7314 4.2366 8.8206 8.8947 7.9368 4.7702 4.7517 4.7533 6.4207 6.4166 7.0294 9.2376 9.2981 7.6329 7.6007 1.0820 1.0953 1.0947 10.6780 1.1055 1.1056 1.1063 5.5227 12.3687 3.9578 3.9568 2.8605 2.8642 2.8748 2.8454 3.5628 3.5553 5.9295 1.0890 1.0874 1.0874 1.8699 1.9706 1.6728 4.6587 4.2911 1.2511 1.2510 1.2503 3.4222 1.1312 1.1298 1.1413 2.5843 2.5767 1.6042 1.6622 1.6717 6.3757 1.4999 1.5026 1.7734 1.7383 1.7354 1.5100 8.2947 8.2986 1.1242 1.1227 1.0983 1.0766 1.0792 1.0814 1.2146 1.2150 1.1063 6.0149 5.9826 11.8416 1.0554 1.0555 1.0555 1.0593 1.0592 1.0593 1.0618 1.0618 1.0620 1.1090 1.1097 1.1076 1.1069 1.1085 1.1086 1.1082 1.1082 1.1082
irintensity: 10.6474 1.9827 0.2182 1.0626 1.0718 0.0499 0.0633 0.0017 7.1496 0.5533 1.3194 0.0000 0.3135 0.0278 6.5064 0.2487 1.6594 1.6445 14.9424 14.9422 0.0002 0.1939 0.1954 0.5859 0.5652 16.6282 1.8672 0.4601 20.6979 0.0001 0.0019 0.0010 0.0512 0.0052 4.9637 4.8784 4.5759 4.5297 0.1019 0.0948 4.2975 4.2906 0.2793 0.0465 0.0078 0.0115 3.4667 3.7814 3.5779 7.3525 7.0426 0.0262 0.0456 0.0434 0.0012 0.0454 0.0557 0.1968 5.2855 4.8873 1.1647 10.8291 12.1522 0.0009 16.5741 16.1176 0.1020 70.9292 70.3004 0.5592 203.7668 201.7908 137.8800 130.8639 16.7030 2.6435 8.3303 8.3383 130.1281 132.3743 2.1125 1483.6904 1480.9594 0.0208 0.3609 114.3532 121.5575 59.2822 67.4360 0.7527 96.3777 91.0508 11.2351 2.7816 11.5804 37.4754 6.1765 39.7047 54.6355 0.4497 58.1330 68.4096
temp: 298.150 k
press: 1.00000 atm
elementType: 7 7 7 7 7 7 6 6 6 6 6 6 6 6 6 6 6 6 1 1 1 1 1 1 1 1 1 1 1 1 1 1 1 1 1 1
symmnumber: 1
zpe: 782169.6 jmol-1
zpe.correction: 0.297913 hartree
zpe.thermalcorrener: 0.315394 hartree
zpe.thermalcorrenthalpy: 0.316338 hartree
zpe.thermalcorrgfe: 0.249238 hartree
zpe.sumelectzpe: -795.167507 hartree
zpe.sumelectthermal: -795.150026 hartree
zpe.sumelectthermalent: -795.149082 hartree
zpe.sumelectthermalfe: -795.216182 hartree
dipole: -0.0003 -0.0011 0.3682
dipole: 0.3682
quadrupole: -88.7064 -88.7145 -105.1493
quadrupole: 0.0005 0.0058 0.0214
quadrupole: 5.4837 5.4756 -10.9592 0.0005 0.0058 0.0214
hfenergy: -795.4654199 hartree
pointgroup: C01 [X(C12H18N6)]
dipole: 0.0003925 0.0000964 -0.1448485 debye
polarizability: 223.2892471|-0.0005204|223.3229464|-0.0534444|-0.0197877|103.58937 unknown
InChI: InChI=1S/C12H18N6/c1-4-16(5-1)10-13-11(17-6-2-7-17)15-12(14-10)18-8-3-9-18/h1-9H2
charge 0 multiplicity 1
36 atoms
N  -2.693725 -0.000884 0.030244
N  1.346852 -2.332101 0.025433
N  1.345406 2.332901 0.024242
N  -0.709572 -1.228877 0.022128
N  -0.710096 1.228577 0.020259
N  1.418511 0.000277 0.01939
C  -3.685473 1.095954 -0.02893
C  -3.682428 -1.100524 -0.029934
C  0.89253 -3.739497 -0.03026
C  2.793614 -2.639192 -0.031106
C  2.791289 2.644156 -0.029064
C  0.887062 3.73903 -0.032967
C  -4.812501 -0.003797 -0.077373
C  2.408358 -4.166065 -0.078373
C  2.401831 4.169897 -0.077595
C  -1.330773 -0.000302 0.024449
C  0.665035 -1.151926 0.021681
C  0.664517 1.152187 0.018958
H  -3.592702 1.730078 -0.929381
H  -3.683657 1.747048 0.863746
H  -3.679137 -1.752544 0.862026
H  -3.587309 -1.733423 -0.93099
H  0.296391 -3.978127 -0.929774
H  0.328296 -4.06139 0.863495
H  3.35432 -2.31017 0.862243
H  3.296881 -2.240976 -0.930895
H  3.298085 2.247571 -0.927593
H  3.350621 2.316765 0.865768
H  0.31972 4.060107 0.859079
H  0.292312 3.974965 -0.934113
H  -5.484103 -0.005205 0.794502
H  -5.410997 -0.004025 -1.000952
H  2.745289 -4.747201 0.793319
H  2.707586 -4.68406 -1.00212
H  2.734937 4.752195 0.794785
H  2.702126 4.688381 -1.000726
