program: Gaussian 09
title: 000152075
version: EM64L-G09RevD.01
frameworkgroup: C1[X(C11H12Cl3O6P)]
method: RPBEPBE
basis: SDD
operation: Freq
keyword: #p
keyword: freq=noraman
keyword: PBEPBE/SDD
title: #p freq=noraman PBEPBE/SDD
converged: YES YES NO NO
title: Mulliken charges:
elementType: Cl Cl Cl P O O O O O O C C C C C C C C C C C H H H H H H H H H H H H
charge: -0.009792 0.009262 0.006549 1.392001 -0.546684 -0.470770 -0.498867 -0.263903 -0.572162 -0.246628 0.550093 -0.378477 -0.326121 -0.281270 -0.068632 -0.187123 0.305809 -0.098464 -0.226870 -0.492664 -0.668097 0.279671 0.272159 0.313893 0.285315 0.233170 0.235378 0.242163 0.282182 0.245619 0.233442 0.233272 0.216543
chargesum: 0.00000
title: Mulliken charges with hydrogens summed into heavy atoms:
elementType: Cl Cl Cl P O O O O O O C C C C C C C C C C C
charge: -0.009792 0.009262 0.006549 1.392001 -0.546684 -0.470770 -0.498867 -0.263903 -0.572162 -0.246628 0.550093 0.173353 -0.326121 0.032623 -0.068632 0.098193 0.305809 -0.098464 0.241679 0.277301 0.015160
polarizability: 2.68652363e+02 2.00883147e+01 1.94579312e+02 -1.36616913e+01 1.36607819e+00 1.22231947e+02
1716.lowfreq: -4.7337 -3.3860 -0.0033 -0.0018 -0.0010 4.3710 9.3457 13.6340 22.5312
frequency: 9.2634 13.4962 22.4702 25.8014 46.6284 52.5139 65.7009 89.2202 105.5478 119.1793 132.4618 136.9680 142.9376 151.3196 155.5432 174.0137 184.5078 193.4143 215.4864 225.3827 245.7316 275.6290 295.2225 305.4599 313.4656 338.9368 351.5225 370.0408 401.9305 426.7435 443.0463 447.8580 499.6698 516.1554 546.7831 591.5653 611.1173 636.7002 659.1800 675.4124 688.2391 715.7437 756.0303 799.0235 818.5825 850.9513 881.1838 892.0578 895.0595 946.6117 993.2322 1008.3600 1023.5532 1036.9861 1068.6557 1113.8133 1114.1013 1121.5284 1135.0951 1135.1327 1156.6458 1214.8630 1224.0121 1238.4678 1250.5859 1325.6304 1332.8551 1359.9168 1363.8103 1404.1163 1420.4175 1439.2511 1446.0675 1458.4794 1463.5662 1473.4041 1480.6163 1485.6608 1559.8675 1581.2609 1657.9060 2999.1064 3001.5196 3014.5185 3017.9931 3075.1214 3095.8609 3101.5044 3111.9458 3118.3209 3143.6954 3159.0332 3183.0343
redmass: 5.6912 8.9762 5.4112 4.3726 3.2564 9.2650 12.2243 7.1635 3.8808 3.8746 6.0312 2.5957 1.3772 2.8869 7.4302 6.8809 17.5235 5.3419 8.2780 7.1942 1.2481 7.1438 11.3242 10.1348 16.2851 8.4163 8.0905 4.8585 8.0685 8.3122 4.7570 3.8418 10.9944 6.7092 3.5836 9.3403 10.0725 8.9922 7.8203 7.0967 3.8211 9.1230 11.8504 1.0975 3.8821 1.4560 1.4249 7.7046 8.1070 11.3512 2.6064 3.2116 3.0897 6.5941 14.1727 2.2483 1.8528 1.2480 1.3463 1.3897 4.0019 1.0935 5.2545 1.2442 1.1363 7.9053 1.3552 1.4417 10.9681 1.2620 1.1246 1.0787 2.9552 1.0531 1.0398 1.0634 1.0548 1.0668 9.2010 8.4203 10.2213 1.0360 1.0286 1.0582 1.0614 1.1070 1.0985 1.1016 1.1030 1.1053 1.1062 1.0937 1.0931
irintensity: 0.2470 0.6503 0.7407 0.2820 0.1666 1.3310 0.0365 1.2365 1.0314 4.2334 4.3828 1.4821 2.1897 7.5271 0.1129 7.3916 2.5645 8.8214 6.3572 5.6283 1.1210 26.4364 3.9327 13.5411 1.5873 13.3021 0.4768 26.8086 16.1380 7.2995 22.9301 10.0347 29.5853 25.7078 9.8067 31.7308 20.2789 25.8206 70.3079 49.2950 7.7492 114.3174 251.4240 4.3875 7.4588 3.8185 39.9816 59.6210 84.2296 188.8857 64.0535 85.3734 196.9697 154.8881 152.0910 19.3358 60.1716 16.9679 3.8642 4.0557 301.7279 7.2717 92.2986 3.4746 0.0744 76.0791 31.2242 3.3391 10.6228 23.1403 15.3874 28.1411 291.6664 13.5249 12.9155 5.2749 13.8091 13.9308 1.9693 16.5512 181.2731 18.8436 36.4569 17.9708 18.7979 6.2836 25.5504 0.2657 40.1247 6.3456 6.1393 5.3178 1.0892
temp: 298.150 k
press: 1.00000 atm
elementType: 17 17 17 15 8 8 8 8 8 8 6 6 6 6 6 6 6 6 6 6 6 1 1 1 1 1 1 1 1 1 1 1 1
symmnumber: 1
zpe: 577599.1 jmol-1
zpe.correction: 0.219996 hartree
zpe.thermalcorrener: 0.244123 hartree
zpe.thermalcorrenthalpy: 0.245067 hartree
zpe.thermalcorrgfe: 0.160704 hartree
zpe.sumelectzpe: -2597.493791 hartree
zpe.sumelectthermal: -2597.469664 hartree
zpe.sumelectthermalent: -2597.468720 hartree
zpe.sumelectthermalfe: -2597.553083 hartree
dipole: 4.8381 3.3384 2.2294
dipole: 6.2867
quadrupole: -132.3152 -156.3934 -146.7969
quadrupole: 6.9790 4.5134 -5.6391
quadrupole: 12.8533 -11.2249 -1.6284 6.9790 4.5134 -5.6391
hfenergy: -2597.7137874 hartree
pointgroup: C01 [X(C11H12Cl3O6P1)]
dipole: 1.939201 -0.8611273 -1.2710317 debye
polarizability: 266.3596255|-28.0841704|181.4473714|10.5618625|27.7439547|137.6566243 unknown
InChI: InChI=1S/C11H12Cl3O6P/c1-3-18-11(15)6-19-21(16,17-2)20-10-5-8(13)7(12)4-9(10)14/h4-5H,3,6H2,1-2H3
charge 0 multiplicity 1
33 atoms
Cl -0.660656 -2.579143 -0.99662
Cl -5.338965 1.633623 0.282858
Cl -5.893677 -0.923063 -1.719325
P  0.394362 1.291252 1.007457
O  -0.476876 -0.215494 0.832431
O  1.780735 0.632014 1.77123
O  0.685575 1.562363 -0.662072
O  4.498393 -0.991486 -0.060405
O  -0.27174 2.46298 1.831966
O  3.807425 1.237814 -0.127196
C  -1.738689 -0.306669 0.224085
C  2.536302 -0.469424 1.159834
C  -1.984825 -1.401823 -0.635912
C  -2.776037 0.611314 0.503333
C  -4.040591 0.434896 -0.090403
C  -3.250849 -1.585552 -1.218315
C  3.657432 0.061583 0.263317
C  -4.281239 -0.661456 -0.947021
C  5.656492 -0.672062 -0.961405
C  1.224987 2.886343 -1.096386
C  6.416246 -1.974768 -1.17991
H  1.879918 -1.150249 0.586045
H  2.969194 -1.027121 2.005596
H  -2.593453 1.452549 1.179825
H  -3.435844 -2.433499 -1.882147
H  5.252509 -0.25045 -1.89922
H  6.268515 0.102346 -0.4655
H  1.029252 2.913113 -2.178035
H  2.305871 2.914343 -0.887764
H  0.690589 3.706673 -0.586397
H  5.772845 -2.733128 -1.657171
H  6.78699 -2.382074 -0.224131
H  7.284209 -1.791344 -1.838942
