program: Gaussian 09
title: 000152041
version: EM64L-G09RevD.01
frameworkgroup: C1[X(C18H25N3O7S)]
method: RPBEPBE
basis: SDD
operation: Freq
keyword: #p
keyword: freq=noraman
keyword: PBEPBE/SDD
title: #p freq=noraman PBEPBE/SDD
converged: YES YES NO NO
title: Mulliken charges:
elementType: S O O O O O O O N N N C C C C C C C C C C C C C C C C C C H H H H H H H H H H H H H H H H H H H H H H H H H
charge: 0.159371 -0.507374 -0.302105 -0.257010 -0.438336 -0.235797 -0.448471 -0.271876 -0.382483 -0.337560 -0.645530 -0.214724 -0.648567 -0.636002 -0.567434 -0.395288 0.250512 -0.149444 0.200738 0.595881 -0.307955 -0.446607 -0.369942 0.191754 -0.456659 -0.211961 -0.245660 -0.244210 0.240365 0.295193 0.245925 0.332965 0.267248 0.214139 0.272702 0.220065 0.241501 0.355189 0.290605 0.244524 0.229001 0.324100 0.235367 0.253162 0.295036 0.300068 0.259629 0.284405 0.231902 0.243592 0.237188 0.412321 0.379690 0.416858
chargesum: 0.00000
title: Mulliken charges with hydrogens summed into heavy atoms:
elementType: S O O O O O O O N N N C C C C C C C C C C C C C C C C C C
charge: 0.159371 -0.095053 -0.302105 -0.257010 -0.058645 -0.235797 -0.031613 -0.271876 -0.027294 -0.013459 -0.050426 0.080468 -0.069677 -0.368754 -0.080593 0.066278 0.250512 0.141161 0.200738 0.595881 0.165570 -0.211240 -0.116780 0.191754 0.087375 0.019941 -0.002068 -0.007023 0.240365
polarizability: 2.89395330e+02 2.92392932e+01 2.56268961e+02 4.00119696e-01 1.36817047e+01 2.04724274e+02
1716.lowfreq: -12.2028 -8.1177 -0.0009 0.0001 0.0014 1.9893 10.3588 18.9766 25.8150
frequency: 6.0125 18.7764 25.5935 33.8427 37.1983 40.5910 48.7135 54.1728 59.8900 74.7056 82.2464 95.6450 100.1744 108.3420 118.4622 123.6421 154.6370 162.9290 179.2998 207.3044 213.1026 229.8773 255.0876 260.5156 263.3729 282.0818 290.5410 297.2332 305.9719 320.2029 332.4446 336.7347 357.6363 401.0028 408.8870 427.2411 438.3584 479.8489 485.3495 493.5728 523.4131 528.4881 565.5032 583.1343 600.5851 601.4740 609.5463 612.1881 637.6754 645.6127 659.1574 666.4660 677.7572 681.9691 699.7160 704.5789 707.0718 726.6937 768.0291 771.2731 779.7142 829.4158 832.3010 854.2211 854.7737 870.4473 892.7419 917.8593 920.5127 953.7431 961.9111 970.0694 977.3418 989.2422 992.1259 999.0247 1007.8820 1014.6199 1018.2043 1026.3021 1031.2692 1042.4501 1053.8619 1059.3977 1083.9104 1102.0137 1117.7371 1144.3879 1154.4992 1174.3084 1179.2271 1185.5297 1187.8927 1190.6415 1197.1058 1215.3809 1223.6013 1237.0645 1240.6191 1248.4316 1255.5809 1271.0553 1273.3827 1297.9144 1302.2835 1309.0315 1316.2582 1322.4726 1331.3650 1331.7356 1357.0734 1360.4433 1382.7582 1388.3566 1439.1758 1440.7306 1444.3990 1458.4544 1459.1568 1471.5695 1475.5665 1477.9481 1481.0010 1503.9644 1579.4761 1591.1701 1609.0389 1629.2999 1634.7226 1662.5106 1662.7358 2695.7638 2866.7610 2976.6442 3002.2313 3006.5973 3013.3282 3020.1656 3021.7579 3044.0958 3071.6707 3079.2713 3089.6041 3108.3395 3119.4616 3125.5126 3137.2768 3137.9671 3149.8885 3166.8820 3385.7804 3445.3056 3469.7684 3518.8080 3537.6915 3574.1805
redmass: 6.4039 5.4833 5.4431 5.9370 6.2659 6.0359 6.0758 5.7767 7.3504 6.4835 6.6738 8.3370 6.8712 6.7870 6.9883 4.8377 6.0266 5.7282 5.1589 4.7467 5.2581 3.3733 3.5029 2.0249 1.5947 4.6298 3.7282 4.1040 5.0326 2.9187 4.9708 4.3470 3.6128 2.8400 3.3309 4.2680 3.9898 4.2659 3.2747 3.3183 3.3060 4.1644 3.8334 5.2244 1.4685 4.8632 5.8831 1.9090 4.3705 3.0959 1.5662 1.4267 1.5022 2.0383 3.8868 1.7839 1.8734 2.7467 3.6153 1.9180 3.8163 4.4024 4.3542 3.6708 1.2595 2.3338 2.1270 1.6696 2.6181 2.1366 1.7610 3.7857 1.3940 5.9938 2.4396 1.3247 1.5216 2.3359 2.2818 2.1890 3.0441 2.6101 2.7233 2.8507 1.6179 1.6305 1.6214 1.4926 1.2062 1.0715 1.6380 1.1957 1.8164 1.1228 1.6248 1.7853 1.6197 1.4749 1.6478 1.5378 1.7913 1.7998 1.3187 1.5170 1.1628 1.2368 1.2586 1.2907 1.4161 1.3899 1.4732 1.2479 7.6072 1.7401 2.0353 1.1055 1.1284 1.1145 1.1196 2.0506 1.2403 1.5440 2.2553 1.7150 6.9420 6.0025 6.0543 6.0417 1.0967 4.2737 4.4893 1.0702 1.0787 1.0818 1.0622 1.0615 1.0635 1.0696 1.0725 1.0636 1.1011 1.1074 1.1002 1.1048 1.0877 1.0869 1.1015 1.0909 1.0958 1.1014 1.0680 1.0454 1.0779 1.0640 1.0765 1.0972
irintensity: 0.1866 0.2845 0.2759 0.6549 0.3449 0.9223 0.7836 0.8385 0.4492 2.4719 1.9460 4.9848 5.1898 9.0286 15.1668 4.1122 4.0743 9.3932 0.2497 9.8170 3.7868 8.5832 17.3167 31.5408 19.7076 1.2158 3.6265 1.5318 3.6476 0.9615 4.2992 1.2577 44.7143 0.3411 2.7038 25.5692 15.8721 26.9095 30.1021 22.1099 15.0207 11.9365 14.3302 17.5662 90.7120 15.8435 1.9173 41.1341 17.1540 22.3591 229.4201 81.7360 46.8300 158.4008 32.5161 117.5326 52.8673 29.0156 18.6428 33.4276 22.6494 17.1606 7.5285 20.7232 0.7596 7.0874 49.5988 8.7554 2.9338 7.0412 71.2532 93.2406 0.3980 0.6107 8.5410 0.7401 51.2730 29.7545 37.9552 6.3387 88.0892 227.7268 13.8982 188.5602 13.6390 2.6611 4.0702 6.7097 62.3988 0.2095 32.3741 4.1590 98.5474 1.4627 11.9883 13.4569 40.8498 0.7141 10.8206 1.3710 63.7189 22.5629 66.6579 36.2429 11.8402 47.5549 11.3780 11.4786 19.6087 23.2421 18.4910 0.8990 0.9800 24.2771 13.2741 10.6022 55.4317 21.8217 29.3121 434.7869 23.8856 63.9727 21.1468 77.3526 152.7550 2.2405 3.3597 86.9595 78.7048 215.9145 151.5064 957.1053 26.2576 14.6257 18.1672 15.2919 22.9166 41.8203 2.3160 23.3375 21.7689 15.2601 8.0140 3.3812 6.9291 2.3514 0.1403 7.9980 26.8191 18.0068 246.2489 5.5175 113.9070 24.7272 20.0305 14.0428
temp: 298.150 k
press: 1.00000 atm
elementType: 16 8 8 8 8 8 8 8 7 7 7 6 6 6 6 6 6 6 6 6 6 6 6 6 6 6 6 6 6 1 1 1 1 1 1 1 1 1 1 1 1 1 1 1 1 1 1 1 1 1 1 1 1 1
symmnumber: 1
zpe: 1116108.3 jmol-1
zpe.correction: 0.425103 hartree
zpe.thermalcorrener: 0.455226 hartree
zpe.thermalcorrenthalpy: 0.456171 hartree
zpe.thermalcorrgfe: 0.359332 hartree
zpe.sumelectzpe: -1787.630705 hartree
zpe.sumelectthermal: -1787.600582 hartree
zpe.sumelectthermalent: -1787.599637 hartree
zpe.sumelectthermalfe: -1787.696476 hartree
dipole: -1.1490 4.2172 2.6913
dipole: 5.1330
quadrupole: -180.9936 -176.5063 -178.9619
quadrupole: 14.6619 -9.2699 -1.5938
quadrupole: -2.1730 2.3143 -0.1413 14.6619 -9.2699 -1.5938
hfenergy: -1788.0558079 hartree
pointgroup: C01 [X(C18H25N3O7S1)]
dipole: -0.0860784 1.6309637 -1.1877798 debye
polarizability: 303.3351366|-14.226392|240.2432605|4.2469526|-15.4872212|206.8101673 unknown
InChI: InChI=1S/C18H25N3O7S/c19-12(18(27)28)6-7-15(23)21-13(17(26)20-8-16(24)25)10-29-14(9-22)11-4-2-1-3-5-11/h1-5,12-14,20-22,24,27H,6-10,19H2
charge 0 multiplicity 1
54 atoms
S  1.174551 0.688393 0.544135
O  3.177431 3.269558 0.439873
O  -1.091519 -2.534983 -1.356256
O  3.136618 -2.286157 1.093836
O  -5.873474 -2.089464 -0.081311
O  -4.715195 -3.878318 0.827273
O  4.349533 1.457173 -0.945389
O  4.919715 1.288557 1.30002
N  0.648411 -2.501355 0.17091
N  3.976303 -1.273364 -0.835552
N  -4.012853 -0.347216 0.837446
C  1.56328 -1.817693 -0.741234
C  1.109949 -0.360825 -1.040489
C  0.910578 2.417491 -0.236592
C  -1.545947 -3.319202 0.934567
C  -2.458632 -2.182084 1.485429
C  -0.65438 -2.786727 -0.181356
C  -3.547945 -1.708713 0.487709
C  2.965495 -1.83515 -0.078036
C  -0.560235 2.801555 -0.318578
C  1.72263 3.460448 0.571475
C  -1.103086 3.274792 -1.539796
C  -1.39997 2.736046 0.824645
C  -4.722058 -2.681146 0.466362
C  5.161565 -0.684806 -0.187164
C  -2.457567 3.6739 -1.62031
C  -2.751219 3.137168 0.747662
C  -3.284678 3.608321 -0.476612
C  4.836304 0.777728 0.150805
H  1.581399 -2.348776 -1.715555
H  1.781742 0.116864 -1.77582
H  0.081523 -0.381142 -1.431638
H  1.344987 2.36414 -1.252206
H  -0.937177 -3.727115 1.762528
H  -2.175608 -4.135291 0.542354
H  -1.83661 -1.305154 1.749017
H  -2.945773 -2.525128 2.414831
H  1.040035 -2.729829 1.092902
H  -3.113912 -1.77349 -0.541945
H  1.505593 4.464204 0.166367
H  1.435542 3.445414 1.63975
H  3.732198 -0.871115 -1.743996
H  -0.467622 3.327863 -2.432737
H  -1.002004 2.337326 1.765192
H  -3.288398 0.363241 0.68341
H  -4.898377 -0.0982 0.383761
H  6.035033 -0.742321 -0.85825
H  5.370191 -1.230092 0.744308
H  -2.865245 4.029353 -2.573078
H  -3.38802 3.080311 1.637471
H  -4.334798 3.914418 -0.537779
H  3.590982 2.806064 1.225129
H  -6.603841 -2.765001 -0.110123
H  3.885656 2.334527 -0.621666
