program: Gaussian 09
title: 000152039
version: EM64L-G09RevD.01
frameworkgroup: C1[X(C12H18FN3O3)]
method: RPBEPBE
basis: SDD
operation: Freq
keyword: #p
keyword: freq=noraman
keyword: PBEPBE/SDD
title: #p freq=noraman PBEPBE/SDD
converged: NO YES NO NO
title: Mulliken charges:
elementType: F O O O N N N C C C C C C C C C C C C H H H H H H H H H H H H H H H H H H
charge: -0.156304 -0.274107 -0.291038 -0.205418 -0.383973 -0.285752 -0.410944 -0.370728 -0.361025 -0.378720 -0.352399 -0.403661 -0.354949 -0.694804 0.350075 0.257632 -0.146418 0.180417 0.121638 0.204690 0.187988 0.187574 0.192576 0.232733 0.208644 0.187338 0.188971 0.251528 0.217302 0.194879 0.196107 0.374933 0.210295 0.216785 0.209780 0.322635 0.375717
chargesum: 0.00000
title: Mulliken charges with hydrogens summed into heavy atoms:
elementType: F O O O N N N C C C C C C C C C C C C
charge: -0.156304 -0.274107 -0.291038 -0.205418 -0.009041 -0.285752 -0.035226 0.021950 0.019126 0.062657 0.023911 0.065169 0.036038 -0.057943 0.350075 0.257632 0.176217 0.180417 0.121638
polarizability: 2.07806935e+02 -3.13816067e+01 1.56645990e+02 -1.98803295e+01 -1.19311318e+01 1.33432198e+02
1716.lowfreq: -7.5868 -4.0254 -0.0008 -0.0005 -0.0001 13.0649 15.9368 20.7938 35.3785
frequency: 13.2231 20.3119 34.7487 47.4243 67.9012 77.6799 86.7155 107.5046 126.3423 144.0220 162.3523 170.1449 197.8661 228.5952 237.8855 247.5684 271.6844 308.8307 325.8609 367.6173 382.7550 394.2411 404.8283 410.7943 441.1608 473.8713 523.9265 588.6649 652.1069 675.2702 705.9665 717.1047 721.8199 726.2771 735.3804 746.4222 776.7862 779.9288 810.4206 817.2455 867.0790 875.9591 908.7855 920.2088 931.3626 993.0784 1001.6630 1026.4977 1059.1294 1064.9329 1086.0623 1090.7628 1121.7795 1132.7415 1143.1850 1190.9852 1197.3040 1205.6415 1228.1813 1245.5437 1256.2339 1272.9127 1281.3902 1288.1527 1295.3976 1302.4553 1305.3663 1336.5245 1350.0850 1354.7670 1364.3884 1366.9358 1382.7843 1388.2670 1457.6903 1458.5534 1462.3917 1465.0245 1473.1817 1477.9290 1481.7119 1488.1243 1519.8802 1617.3358 1642.5074 1674.1091 1710.3095 2951.1704 2952.0880 2959.2480 2968.2491 2971.4320 2978.8167 2986.6765 2997.7485 3008.3275 3015.8904 3033.4836 3047.6939 3068.0447 3070.8611 3077.9273 3183.6448 3319.5753 3514.2238
redmass: 5.0363 6.4837 1.6109 5.4669 4.5230 11.5066 4.0045 1.7399 2.7844 2.4919 9.7102 4.4310 4.4669 4.2559 1.1057 3.8738 5.9196 8.7002 3.8299 8.9769 4.9498 13.2176 3.4428 3.8077 3.5248 11.7482 2.6496 7.8660 5.4555 3.6625 3.2974 7.6491 1.1002 5.8341 1.1673 5.5923 1.3211 1.8761 1.2941 2.1508 1.5067 2.3815 1.9531 1.3193 1.7250 1.4057 3.9563 2.6012 2.4949 2.9749 2.3662 2.7120 2.3862 6.5136 2.1053 2.4884 1.7762 4.0877 1.3111 1.3220 3.5963 1.3119 1.1315 1.0971 1.1063 2.2920 1.2304 1.3729 1.4184 1.6507 1.8519 1.3911 5.6932 1.2156 1.0937 1.0782 1.0679 1.0754 1.0782 1.0424 1.0817 1.0867 1.7536 4.8335 9.2841 7.4599 7.5143 1.0588 1.0590 1.0593 1.0587 1.0366 1.0616 1.0961 1.0988 1.0668 1.0986 1.1031 1.1017 1.1007 1.0994 1.1049 1.0928 1.0827 1.0770
irintensity: 0.3177 0.2350 0.0238 0.0439 0.3571 3.5882 0.0728 0.0122 0.0292 0.1898 11.0135 1.0634 2.0821 5.1906 0.0071 1.8361 0.2910 4.6029 26.0410 1.7990 2.1540 16.2357 0.0678 3.9666 5.8284 7.6445 3.9206 6.4037 0.8205 19.5985 0.5822 0.7072 14.5597 8.1430 0.6463 33.9431 18.6198 86.2193 153.5994 37.1562 2.1298 1.6461 3.8929 38.5484 1.1970 15.8907 16.1050 69.2120 11.5044 15.4632 4.2981 21.1500 12.3994 100.3978 12.1182 114.4520 25.8145 36.4367 6.2706 1.4839 308.4741 0.3004 1.1971 0.3564 1.2337 73.0816 3.7678 2.6273 5.0432 1.3433 31.3852 9.0748 38.4356 11.1485 25.4452 3.3483 1.0133 1.4944 4.4534 12.1130 5.6265 24.8264 685.1049 105.2758 149.3524 335.3339 418.1928 1.0909 0.1261 23.7809 98.8376 34.3800 46.9874 2.8565 2.8453 26.4350 2.2018 28.2581 122.8593 95.7484 53.6445 17.2532 33.3945 202.5648 67.9109
temp: 298.150 k
press: 1.00000 atm
elementType: 9 8 8 8 7 7 7 6 6 6 6 6 6 6 6 6 6 6 6 1 1 1 1 1 1 1 1 1 1 1 1 1 1 1 1 1 1
symmnumber: 1
zpe: 781159.3 jmol-1
zpe.correction: 0.297528 hartree
zpe.thermalcorrener: 0.317344 hartree
zpe.thermalcorrenthalpy: 0.318288 hartree
zpe.thermalcorrgfe: 0.245693 hartree
zpe.sumelectzpe: -956.431920 hartree
zpe.sumelectthermal: -956.412104 hartree
zpe.sumelectthermalent: -956.411160 hartree
zpe.sumelectthermalfe: -956.483754 hartree
dipole: -4.4095 1.3756 1.9057
dipole: 4.9967
quadrupole: -134.3569 -118.4482 -115.8061
quadrupole: 5.9097 5.7465 3.7095
quadrupole: -11.4865 4.4222 7.0643 5.9097 5.7465 3.7095
hfenergy: -956.7294476 hartree
pointgroup: C01 [X(C12H18F1N3O3)]
dipole: -1.7454891 -0.4861467 -0.762598 debye
polarizability: 209.2023693|29.7981418|155.5446336|20.2820262|-11.9688377|133.1381202 unknown
InChI: InChI=1S/C12H18FN3O3/c1-2-3-4-5-6-7-14-11(18)16-8-9(13)10(17)15-12(16)19/h8,14-15H,2-7H2,1H3
charge 0 multiplicity 1
37 atoms
F  4.899209 0.210223 1.922483
O  0.889566 -2.374626 0.99063
O  1.029072 0.631998 -1.979681
O  4.989509 2.249743 -0.114087
N  -0.157109 -1.486402 -0.907106
N  1.87579 -0.49758 -0.067364
N  2.998049 1.374535 -0.990954
C  -3.151763 -0.704282 -0.458845
C  -4.313328 -0.284374 0.469731
C  -2.454235 -2.001203 0.008298
C  -5.047576 0.990412 -0.005214
C  -1.280248 -2.446805 -0.894748
C  -6.195136 1.41903 0.937582
C  -6.937144 2.681369 0.446896
C  0.806054 -1.543678 0.048313
C  1.906276 0.506234 -1.071122
C  2.881292 -0.567127 0.909429
C  3.923507 0.312794 0.936915
C  4.07468 1.392826 -0.045961
H  -2.411813 0.120749 -0.51086
H  -3.539868 -0.844363 -1.49009
H  -5.041772 -1.118871 0.545854
H  -3.920526 -0.121085 1.495064
H  -2.081052 -1.88301 1.04427
H  -3.191817 -2.828971 0.032228
H  -5.455605 0.821968 -1.02398
H  -4.319664 1.823778 -0.096073
H  -0.891868 -3.420233 -0.547083
H  -1.624258 -2.5621 -1.939215
H  -6.91502 0.581243 1.039075
H  -5.7843 1.600523 1.951768
H  -0.093666 -0.731049 -1.611103
H  -6.243998 3.539399 0.35809
H  -7.746916 2.972134 1.141163
H  -7.389689 2.512882 -0.548734
H  2.757173 -1.375805 1.634743
H  3.027494 2.101123 -1.715211
